{"text_format":"1","workbook":"xlsx","n_sheets":18,"sheets":["PORTADA","MENU","OBLIGACIONES","BASES","APEND6","ANALISIS","FSBC","RIMSS","RISR_IMSS","CUOTASIMSS","CYVSS","IMSS","EMISIONM","EMISIONB","RESUMEN IMSS","TARIFA","GENERALES1","GENERAL"],"not_rendered":{"charts":0,"images":15,"macros":1,"external_links":0,"defined_names":10,"comments":2,"pivot_tables":0},"unopened":[],"bounds":{"document_bytes":16777216,"sheet_cells":100000,"rows_first":2000,"rows_last":500,"rows_between":2000,"halvings":0,"cell_chars":16384,"cell_head_chars":4096},"cells_cut":0,"cells_raw":0,"read":"whole","date_system":"1900"}

{"sheet":"PORTADA","index":0,"n_rows":261,"n_cols":21,"rows_kept":261,"cut":false,"hidden":false,"merged":[[1,1,10,9],[11,1,11,9],[12,1,26,9]]}
[]
[null,14896532]
[]
[]
[]
[]
[]
[]
[]
[]
{"$rows_left_out":252}
{"sheet":"MENU","index":1,"n_rows":22,"n_cols":3,"rows_kept":22,"cut":false,"hidden":true,"merged":[]}
[]
[]
[]
[]
[null,"Descripción","Nombre de la hoja"]
[null,"Obligaciones de los patrones","OBLIGACIONES"]
[null,"Obligaciones laborales","LABORAL"]
[null,"Determinación de las bases de ISR","BASES"]
[null,"Apendice sies guía de llenado del SAT","APEND6"]
[null,"Analisis apéndice sies guía de llenado del SAT","ANALISIS"]
{"$rows_left_out":13}
{"sheet":"OBLIGACIONES","index":2,"n_rows":37,"n_cols":4,"rows_kept":37,"cut":false,"hidden":true,"merged":[[36,2,36,3],[9,2,9,3],[10,3,16,3],[17,2,17,3],[18,3,26,3],[27,2,27,3],[28,3,35,3]]}
[]
[]
[]
[null,null,null,"Ir al MENÚ"]
[]
[null,"Concepto","Disposición","Fundamento"]
[null,"Trabajador","Trabajador es la persona física que presta a otra, física o moral, un trabajo personal subordinado.\n\nPara los efectos de esta disposición, se entiende por trabajo toda actividad humana, intelectual o material, independientemente del grado de preparación técnica requerido por cada profesión u oficio.","Artículo 8 LFT"]
[null,"Trabajador de confianza","La categoría de trabajador de confianza depende de la naturaleza de las funciones desempeñadas y no de la designación que se dé al puesto.\n\nSon funciones de confianza las de dirección, inspección, vigilancia y fiscalización, cuando tengan carácter general, y las que se relacionen con trabajos personales del patrón dentro de la empresa o establecimiento.","Artículo 9 LFT"]
[null,"Patrón","Patrón es la persona física o moral que utiliza los servicios de uno o varios trabajadores.\n\nSi el trabajador, conforme a lo pactado o a la costumbre, utiliza los servicios de otros trabajadores, el patrón de aquél, lo será también de éstos.","Artículo 10 LFT"]
[null,"Obligaciones","Fiscales"]
{"$rows_left_out":28}
{"sheet":"BASES","index":3,"n_rows":209,"n_cols":8,"rows_kept":209,"cut":false,"hidden":true,"merged":[[6,3,6,4],[6,5,6,6],[13,1,13,2],[13,3,13,6],[14,1,14,2],[14,3,14,5],[26,1,26,2],[26,3,26,5],[30,1,30,2],[30,3,30,6],[31,1,31,2],[31,3,31,5],[19,1,19,2],[19,3,19,6],[20,1,20,2],[20,3,20,5],[25,1,25,2],[25,3,25,6],[43,1,43,2],[43,3,43,5],[47,1,47,2],[47,3,47,6],[48,1,48,2],[48,3,48,5],[36,1,36,2],[36,3,36,6],[37,1,37,2],[37,3,37,5],[42,1,42,2],[42,3,42,6],[59,1,59,2],[59,3,59,5],[64,1,64,2],[64,3,64,6],[65,1,65,2],[65,3,65,5],[52,1,52,2],[52,3,52,6],[53,1,53,2],[53,3,53,5],[58,1,58,2],[58,3,58,6],[76,1,76,2],[76,3,76,5],[81,1,81,2],[81,3,81,6],[82,1,82,2],[82,3,82,5],[69,1,69,2],[69,3,69,6],[70,1,70,2],[70,3,70,5],[75,1,75,2],[75,3,75,6],[94,1,94,2],[94,3,94,5],[99,1,99,2],[99,3,99,6],[100,1,100,2],[100,3,100,5],[87,1,87,2],[87,3,87,6],[88,1,88,2],[88,3,88,5],[93,1,93,2],[93,3,93,6],[111,1,111,2],[111,3,111,5],[115,1,115,2],[115,3,115,6],[116,1,116,2],[116,3,116,5],[105,1,105,2],[105,3,105,6],[106,1,106,2],[106,3,106,5],[110,1,110,2],[110,3,110,6],[127,1,127,2],[127,3,127,5],[132,1,132,2],[132,3,132,6],[133,1,133,2],[133,3,133,5],[120,1,120,2],[120,3,120,6],[121,1,121,2],[121,3,121,5],[126,1,126,2],[126,3,126,6],[145,1,145,2],[145,3,145,5],[150,1,150,2],[150,3,150,6],[151,1,151,2],[151,3,151,5],[138,1,138,2],[138,3,138,6],[139,1,139,2],[139,3,139,5],[144,1,144,2],[144,3,144,6],[163,1,163,2],[163,3,163,5],[168,1,168,2],[168,3,168,6],[169,1,169,2],[169,3,169,5],[156,1,156,2],[156,3,156,6],[157,1,157,2],[157,3,157,5],[162,1,162,2],[162,3,162,6],[181,1,181,2],[181,3,181,5],[186,1,186,2],[186,3,186,6],[187,1,187,2],[187,3,187,5],[174,1,174,2],[174,3,174,6],[175,1,175,2],[175,3,175,5],[180,1,180,2],[180,3,180,6],[198,1,198,2],[198,3,198,5],[203,1,203,2],[203,3,203,6],[204,1,204,2],[204,3,204,5],[192,1,192,2],[192,3,192,6],[193,1,193,2],[193,3,193,5],[197,1,197,2],[197,3,197,6]]}
[]
[]
[]
[null,null,null,"Valor de la UMA",113.14,null,"Ir al MENÚ"]
[]
[]
[null,null,null,"Percepción",null,"Deducción"]
[null,"c_TipoPercepcion","Descripción","Gravado","Exento","Gravado","Exento"]
[null,1,"Sueldos, Salarios  Rayas y Jornales",null,null,null,null,{"$f":"IF(E9>0,HYPERLINK(\"#\"& \"APEND6!B17\",\"Ver apéndice\"),\"\")","v":""}]
[null,12,"Anticipo de salarios"]
{"$rows_left_out":200}
{"sheet":"APEND6","index":4,"n_rows":150,"n_cols":8,"rows_kept":150,"cut":false,"hidden":true,"merged":[[100,1,100,4],[100,6,100,7],[3,1,3,7],[4,1,4,7],[5,1,5,7],[6,1,6,7],[7,1,7,7],[14,1,14,4],[14,6,14,7],[51,1,51,2],[87,1,87,7],[89,1,89,4],[89,6,89,7],[98,1,98,7],[138,1,138,4],[138,6,138,7],[145,1,145,2],[111,1,111,2],[120,1,120,7],[122,1,122,4],[122,6,122,7],[127,1,127,2],[136,1,136,4]]}
[]
[]
[]
[null,"Para el TipoRegimen “002-Sueldos”"]
[null,"Para el TipoRegimen “003- Jubilados”, “004-Pensionados” y “012- Jubilados o Pensionados”, específicamente para los casos de Jubilación en una sola exhibición"]
[null,"Para el TipoRegimen “003- Jubilados”, “004-Pensionados” y “012- Jubilados o Pensionados”, específicamente para los casos de Jubilación en parcialidades"]
[null,"Para el TipoRegimen “05-Asimilados Miembros Sociedades Cooperativas Produccion”, “06-Asimilados Integrantes Sociedades Asociaciones Civiles”, “07-Asimilados Miembros consejos”, “08-Asimilados comisionistas”, “09- Asimilados Honorarios”, “10-Asimilados acciones” y “11-Asimilados otros”"]
[null,"Para el TipoRegimen “13- Indemnización o Separación”"]
[]
[]
{"$rows_left_out":141}
{"sheet":"ANALISIS","index":5,"n_rows":73,"n_cols":7,"rows_kept":73,"cut":false,"hidden":true,"merged":[[22,6,23,6],[27,1,27,4],[34,3,34,4],[34,1,34,2],[7,1,7,4],[3,1,3,4],[4,1,4,4],[5,1,5,4],[6,1,6,4],[18,1,18,4],[9,1,9,4],[61,1,61,2],[14,1,14,4],[20,1,20,2],[20,3,20,4],[45,1,45,4],[43,1,43,4],[56,1,56,4],[58,1,58,4],[40,1,40,2],[40,3,40,4],[24,1,24,4]]}
[]
[null,null,null,null,"Ir al MENÚ"]
[]
[null,"Artículo 5 A LSS. Para los efectos de esta Ley, se entiende por:\nV. \tTrabajadores o trabajador: la persona física que la Ley Federal del Trabajo define como tal;\nVI. \tTrabajador permanente: aquél que tenga una relación de trabajo por tiempo indeterminado;\nVII. \tTrabajador eventual: aquél que tenga una relación de trabajo para obra determinada o por tiempo determinado en los términos de la Ley Federal del Trabajo"]
[null,"Artículo 8o LFT.- Trabajador es la persona física que presta a otra, física o moral, un trabajo personal subordinado.\n\nPara los efectos de esta disposición, se entiende por trabajo toda actividad humana, intelectual o material, independientemente del grado de preparación técnica requerido por cada profesión u oficio."]
[null,"Artículo 5 A LSS. Para los efectos de esta Ley, se entiende por:\nXVIII. \tSalarios o salario: la retribución que la Ley Federal del Trabajo define como tal"]
[null,"Artículo 82 LFT.- Salario es la retribución que debe pagar el patrón al trabajador por su trabajo."]
[null,"Artículo 27 LSS. El salario base de cotización se integra con los pagos hechos en efectivo por cuota diaria, gratificaciones, percepciones, alimentación, habitación, primas, comisiones, prestaciones en especie y cualquiera otra cantidad o prestación que se entregue al trabajador por su trabajo. Se excluyen como integrantes del salario base de cotización, dada su naturaleza, los siguientes conceptos:"]
[]
[null,"Artículo 30 LSS. Para determinar el salario diario base de cotización se estará a lo siguiente:\n\nI. Cuando además de los elementos fijos del salario el trabajador percibiera regularmente otras retribuciones periódicas de cuantía previamente conocida, éstas se sumarán a dichos elementos fijos"]
{"$rows_left_out":64}
{"sheet":"FSBC","index":6,"n_rows":91,"n_cols":9,"rows_kept":91,"cut":false,"hidden":true,"merged":[[24,1,24,4],[84,1,84,3],[25,1,25,4],[26,1,26,4],[27,1,27,4],[28,1,28,5],[19,1,19,4],[20,1,20,4],[1,1,1,2],[11,1,11,4],[12,1,12,4],[13,1,13,4],[14,1,14,4],[18,1,18,4],[6,1,6,5],[7,1,7,4],[8,1,8,4],[9,1,9,4],[10,1,10,4]]}
[]
[null,"Solo capture información en las celdas de color verde"]
[]
[]
[null,"Ir al MENÚ",null,null,"Valor de la UMA",108.57]
[null,null,null,null,"Salario diario del trabajador",380]
[null,"Artículo 27 LSS. El salario base de cotización se integra con los pagos hechos en efectivo por cuota diaria, gratificaciones, percepciones, alimentación, habitación, primas, comisiones, prestaciones en especie y cualquiera otra cantidad o prestación que se entregue al trabajador por su trabajo. Se excluyen como integrantes del salario base de cotización, dada su naturaleza, los siguientes conceptos:"]
[null,"I.  Los instrumentos de trabajo tales como herramientas, ropa y otros similares",null,null,null,"https://dof.gob.mx/nota_detalle.php?codigo=5721189&fecha=22/03/2024#gsc.tab=0"]
[null,"II. El ahorro, cuando se integre por un depósito de cantidad semanaria, quincenal o mensual igual del trabajador y de la empresa; si se constituye en forma diversa o puede el trabajador retirarlo más de dos veces al año, integrará salario; tampoco se tomarán en cuenta las cantidades otorgadas por el patrón para fines sociales de carácter sindical."]
[null,"Artículo 93 LISR. No se pagará el impuesto sobre la renta por la obtención de los siguientes ingresos:\nXI. Los provenientes de cajas de ahorro de trabajadores y de fondos de ahorro establecidos por las empresas para sus trabajadores cuando reúnan los requisitos de deducibilidad del Título II de esta Ley o, en su caso, del presente Título.\n\nRequisitos.\nQue sean otorgados en forma general a todos los trabajadores\nEl monto del patrón tiene que ser igual a la aportación de los trabajadores\nNo exceder del 13% del salario del trabajador\nCon un límite del 1.3 veces del valor de la UMA elevada al año\nFundamento: Artículo 27 fracción XI LISR"]
{"$rows_left_out":82}
{"sheet":"RIMSS","index":7,"n_rows":43,"n_cols":10,"rows_kept":43,"cut":false,"hidden":true,"merged":[[12,1,13,1],[12,3,12,4],[12,8,13,8],[13,3,13,4],[6,3,6,4],[7,8,10,8],[9,3,9,4],[10,3,10,4],[11,3,11,4],[14,3,14,4],[16,1,16,4],[18,1,18,6],[37,1,37,2],[40,1,40,3]]}
[]
[]
[null,"Capture información en las celdas de color verde",null,null,"Ir al MENÚ"]
[]
[]
[null,"Seguro y concepto","Prestaciones","Cuota Patrón","Tasa Patrón","Cuota Trabajador","Total","Base salarial","Fundamento legal"]
[null,"Riesgos de Trabajo","En especie y dinero","Conforme con su siniestralidad laboral",null,0,"Prima correspondiente","Salario base de cotización (SBC)","Artículo 40, 70, 73 LSS y 24 RMACERF "]
[null,"Enfermedades y Maternidad","En especie","Cuota fija por cada colaborador hasta por tres Salarios Mínimos General Vigente (SMGV) en el DF",0.20399999999999999,0,0.20399999999999999,"UMA","Artículo 105, 106 Y 107 LSS"]
[null,"Enfermedades y Maternidad","En especie","Cuota adicional por la diferencia del SBC y de tres veces el valor de la UMA",1.0999999999999999E-2,4.0000000000000001E-3,1.4999999999999999E-2,"Diferencia entre el SBC y tres UMAS"]
[null,"Enfermedades y Maternidad","En dinero",7.0000000000000001E-3,null,2.5000000000000001E-3,9.4999999999999998E-3,"SBC"]
{"$rows_left_out":34}
{"sheet":"RISR_IMSS","index":8,"n_rows":95,"n_cols":10,"rows_kept":95,"cut":false,"hidden":true,"merged":[[14,1,14,4],[51,1,51,2],[1,1,1,2],[61,1,61,6]]}
[]
[null,"Capture información en las celdas de color verde"]
[]
[null,"Año de cálculo"]
[null,"Mes de cálculo",null,null,null,null,"Ir al MENÚ"]
[null,"Periodicidad de pago"]
[null,"Salario diario"]
[null,"Salario base de cotización"]
[null,"Zona del salario mínimo"]
[null,"Salario mínimo",{"$f":"IFERROR(VLOOKUP(C9,GENERALES1!$B$21:$C$22,2,FALSE),\"\")","v":""}]
{"$rows_left_out":86}
{"sheet":"CUOTASIMSS","index":9,"n_rows":16,"n_cols":9,"rows_kept":16,"cut":false,"hidden":true,"merged":[[11,0,12,0],[11,1,12,1],[11,3,11,4],[11,8,12,8],[12,3,12,4],[13,3,13,4],[15,1,15,4],[5,3,5,4],[6,8,9,8],[8,3,8,4],[9,3,9,4],[10,3,10,4]]}
[]
[]
[]
[]
[null,"Seguro y concepto","Prestaciones","Cuota Patrón","Tasa Patrón","Cuota Trabajador","Total","Base salarial","Fundamento legal"]
[null,"Riesgos de Trabajo","En especie y dinero","Conforme con su siniestralidad laboral",null,0,"Prima correspondiente","Salario base de cotización (SBC)","Artículo 40, 70, 73 LSS y 24 RMACERF "]
[null,"Enfermedades y Maternidad","En especie","Cuota fija por cada colaborador hasta por tres Salarios Mínimos General Vigente (SMGV) en el DF",0.20399999999999999,0,0.20399999999999999,"UMA","Artículo 105, 106 Y 107 LSS"]
[null,"Enfermedades y Maternidad","En especie","Cuota adicional por la diferencia del SBC y de tres veces el valor de la UMA",1.0999999999999999E-2,4.0000000000000001E-3,1.4999999999999999E-2,"Diferencia entre el SBC y tres UMAS"]
[null,"Enfermedades y Maternidad","En dinero",7.0000000000000001E-3,null,2.5000000000000001E-3,9.4999999999999998E-3,"SBC"]
[null,"Enfermedades y Maternidad","Gastos médicos para pensionados y beneficiarios",1.0500000000000001E-2,null,3.7499999999999999E-3,1.43E-2,"SBC"]
{"$rows_left_out":7}
{"sheet":"CYVSS","index":10,"n_rows":81,"n_cols":4,"rows_kept":81,"cut":false,"hidden":true,"merged":[]}
[]
["①"]
[null,"Fecha de cálculo"]
[null,"Zona del salario mínimo"]
[null,"Salario base de cotización"]
[null,"Salario mínimo",{"$f":"IFERROR(VLOOKUP(C4,GENERALES1!$B$21:$C$22,2,FALSE),\"\")","v":""}]
[null,"Valor de la UMA",{"$f":"IFERROR(IF(C3<>\"\",IF(TEXT(C3,\"mmmm\")=\"Enero\",UMAE,UMAF),\"\"),\"\")","v":""}]
[]
[null,"% que le corresponde",0]
[]
{"$rows_left_out":72}
{"sheet":"IMSS","index":11,"n_rows":132,"n_cols":5,"rows_kept":132,"cut":false,"hidden":true,"merged":[]}
[]
[null,"Determinación de las cuotas obrero patronales IMSS"]
[]
[null,"Año de cálculo"]
[null,"Salario base de cotización"]
[null,"Mes a cotizar"]
[null,"Bimestre",null,"AL"]
[null,"Faltas del periodo"]
[null,"Incapacidad del periodo"]
[null,"Prima de riesgo de trabajo"]
{"$rows_left_out":123}
{"sheet":"EMISIONM","index":12,"n_rows":8,"n_cols":20,"rows_kept":8,"cut":false,"hidden":true,"merged":[[5,9,5,10],[5,11,5,12],[5,13,5,14],[5,16,5,17]]}
[]
[null,"Determinación de las cuotas obrero patronales mensuales"]
[null,null,"Año de cálculo "]
[null,null,"Mes "]
[null,null,"Valor de la UMA ",null,null,null,null,null,"Ir al MENÚ"]
[null,null,"Prima de riesgo ",null,null,null,null,null,null,"Enfermedad y maternidad excedente 3 veces el valor de la UMA",null,"Enfermedad y maternidad prestaciones en dinero",null,"Enfermedad y maternidad gastos médicos pensionados",null,null,"Invalidez y vida"]
[null,null,null,null,null,null,null,null,0.20399999999999999,1.0999999999999999E-2,4.0000000000000001E-3,7.0000000000000001E-3,2.5000000000000001E-3,1.0500000000000001E-2,3.7499999999999999E-3,null,1.7500000000000002E-2,6.2500000000000003E-3,0.01]
[null,"NSS","Nombre","Días del mes","Faltas","Incapacidades","Salario diario (opcional)","Salario base de cotización","Cuota Fija","Excedente Patronal","Excedente Obrero","Prestaciones en Dinero Patronal","Prestaciones en Dinero Obrero","Gastos Médicos y Pensionados Patronal","Gastos Médicos y Pensionados Obrero","Riesgos de Trabajo","Invalidez y Vida Patronal","Invalidez y Vida Obrero","Guarderías y Prestaciones Sociales","Total"]

{"sheet":"EMISIONB","index":13,"n_rows":9,"n_cols":19,"rows_kept":9,"cut":false,"hidden":true,"merged":[[6,9,6,10]]}
[]
[null,"Determinación de las cuotas obrero patronales bimestral"]
[null,null,"Año de cálculo "]
[null,null,"Bimestre "]
[null,null,"Salarío mínimo general de la zona ",null,null,null,null,"Ir al MENÚ"]
[null,null,"Valor de la UMA "]
[null,null,null,null,null,null,null,null,null,"Cesantía en Edad Avanzada y Vejez"]
[null,null,null,null,null,null,null,null,0.02,null,1.125E-2,null,0.05]
[null,"NSS","Nombre","Días del bimestre","Faltas","Incapacidades","Salario diario","Salario base de cotización","Retiro","Cesantía en Edad Avanzada y Vejez Patronal","Cesantía en Edad Avanzada y Vejez Obrero","Subtotal RCV","Aportación Patronal INFONAVIT","Tipo de Descuento","Valor de Descuento","Número de Crédito","Amortización","Subtotal Infonavit","Total"]

{"sheet":"RESUMEN IMSS","index":14,"n_rows":23,"n_cols":6,"rows_kept":23,"cut":false,"hidden":true,"merged":[]}
[]
[]
[null,null,null,null,null,"Ir al MENÚ"]
[]
[null,"Resumen Emisión IMSS",null,null,"Resumen Emisión RCV"]
[]
[null,"Periodo Mensual",null,null,"Bimestre"]
[null,"Días",null,null,"Número de acreditados"]
[null,"Total Cotizantes IMSS"]
[null,"Prima de Riesgos de Trabajo",null,null,"Total Aportación Pat. Infonavit"]
{"$rows_left_out":14}
{"sheet":"TARIFA","index":15,"n_rows":207,"n_cols":10,"rows_kept":207,"cut":false,"hidden":true,"merged":[[5,1,5,4]]}
[]
[]
[null,null,"Ir al MENÚ"]
[null,null,null,null,null,null,"Convertir a:",{"$f":"IF(BASES!D209<>\"\",BASES!D209,30)","v":30}]
[]
[null,"V. Tarifa aplicable durante 2025 para el cálculo de los pagos provisionales mensuales a que se refieren los artículos 96 de la Ley del ISR y 175 de su Reglamento, así como la regla 3.12.2."]
[null,"Límite inferior","Límite superior","Cuota fija","Por ciento para aplicarse sobre el excedente del límite inferior",null,"Límite inferior","Límite superior","Cuota fija","Por ciento para aplicarse sobre el excedente del límite inferior"]
[null,"$","$","$","%",null,"$","$","$","%"]
[null,0.01,746.04,0,1.92,null,0.01,{"$f":"IFERROR(IF($H$4<30,ROUND(C9/30.4*$H$4,2),C9),C9)","v":746.04},{"$f":"IFERROR(IF($H$4<30,ROUND(D9/30.4*$H$4,2),D9),D9)","v":0},1.92]
[null,746.05,6332.05,14.32,6.4,null,{"$f":"IFERROR(H9+0.01,H9)","v":746.05},{"$f":"IFERROR(IF($H$4<30,ROUND(C10/30.4*$H$4,2),C10),C10)","v":6332.05},{"$f":"IFERROR(IF($H$4<30,ROUND(D10/30.4*$H$4,2),D10),D10)","v":14.32},6.4]
{"$rows_left_out":198}
{"sheet":"GENERALES1","index":16,"n_rows":46,"n_cols":4,"rows_kept":46,"cut":false,"hidden":true,"merged":[[4,1,4,3],[5,1,5,2],[19,1,19,2],[23,1,23,2]]}
[]
[]
[null,"Ir al MENÚ"]
[]
[null,"Tabla de vacaciones para trabajadores de no buques (art. 76 LFT)"]
[null,"Años"]
[null,"Mínimo","Máximo","Días"]
[null,0,1,12]
[null,{"$f":"C8+0.01","v":1.01},2,{"$f":"D8+2","v":14}]
[null,{"$f":"C9+0.01","v":2.0099999999999998},3,{"$f":"D9+2","v":16}]
{"$rows_left_out":37}
{"sheet":"GENERAL","index":17,"n_rows":117,"n_cols":10,"rows_kept":117,"cut":false,"hidden":true,"merged":[[38,2,38,9],[60,1,60,3],[70,5,70,6]]}
[]
[]
[]
[null,"Enero",{"$f":"IFERROR(DAY(EOMONTH(DATE(EMISIONM!$D$3,ROW($A1),1),0)),\"\")","v":31}]
[null,"Febrero",{"$f":"IFERROR(DAY(EOMONTH(DATE(EMISIONM!$D$3,ROW($A2),1),0)),\"\")","v":28}]
[null,"Marzo",{"$f":"IFERROR(DAY(EOMONTH(DATE(EMISIONM!$D$3,ROW($A3),1),0)),\"\")","v":31}]
[null,"Abril",{"$f":"IFERROR(DAY(EOMONTH(DATE(EMISIONM!$D$3,ROW($A4),1),0)),\"\")","v":30}]
[null,"Mayo",{"$f":"IFERROR(DAY(EOMONTH(DATE(EMISIONM!$D$3,ROW($A5),1),0)),\"\")","v":31}]
[null,"Junio",{"$f":"IFERROR(DAY(EOMONTH(DATE(EMISIONM!$D$3,ROW($A6),1),0)),\"\")","v":30}]
[null,"Julio",{"$f":"IFERROR(DAY(EOMONTH(DATE(EMISIONM!$D$3,ROW($A7),1),0)),\"\")","v":31}]
{"$rows_left_out":107}