{"text_format":"1","workbook":"xlsx","n_sheets":11,"sheets":["PORTADA","MENU","FCFDI","CAMPOS","MATRIZE","DISPO","OTROS","OBJETO","IVA","RETENCION","CATALOGO"],"not_rendered":{"charts":0,"images":16,"macros":1,"external_links":0,"defined_names":1,"comments":1,"pivot_tables":0},"unopened":[],"bounds":{"document_bytes":16777216,"sheet_cells":100000,"rows_first":2000,"rows_last":500,"rows_between":2000,"halvings":0,"cell_chars":16384,"cell_head_chars":4096},"cells_cut":0,"cells_raw":0,"read":"whole","date_system":"1900"}

{"sheet":"PORTADA","index":0,"n_rows":0,"n_cols":0,"rows_kept":0,"cut":false,"hidden":false,"merged":[[25,1,26,9]]}

{"sheet":"MENU","index":1,"n_rows":13,"n_cols":3,"rows_kept":13,"cut":false,"hidden":true,"merged":[]}
[]
[]
[]
[]
[null,"Descripción","Nombre de la hoja"]
[null,"Formato CFDI","FCFDI"]
[null,"Guía de los campos del CFDI","CAMPOS"]
[null,"Matriz de errores del SAT","MATRIZE"]
[null,"Disposiciones fiscales","DISPO"]
[null,"Otras disposiciones fiscales","OTROS"]
[null,"Campo objeto del CFDI","OBJETO"]
[null,"Disposiciones IVA","IVA"]
[null,"Retenciones de ISR e IVA","RETENCION"]

{"sheet":"FCFDI","index":2,"n_rows":47,"n_cols":10,"rows_kept":47,"cut":false,"hidden":true,"merged":[[17,9,17,12],[24,1,24,8],[19,1,19,8],[28,1,28,8],[4,1,4,2],[4,7,4,8],[10,7,10,8],[38,1,38,8],[43,1,43,8],[37,1,37,2]]}
[]
[]
[]
[]
[null,"Nodo comprobante",null,null,null,null,null,"Nodo emisor"]
[null,"Fecha",null,null,null,null,null,"RFC"]
[null,"Serie",null,null,null,null,null,"Nombre"]
[null,"Folio",null,null,null,null,null,"Régimen fiscal",null,{"$f":"IFERROR(VLOOKUP(I8,CATALOGO!$F$29:$G$47,2,FALSE),\"\")","v":""}]
[null,"Forma de pago",null,{"$f":"IFERROR(VLOOKUP(C9,CATALOGO!$B$4:$C$25,2,FALSE),\"\")","v":""},null,null,null,"FacAtrAdquirente"]
[null,"Método de pago",null,{"$f":"IFERROR(VLOOKUP(C10,CATALOGO!$B$28:$C$29,2,FALSE),\"\")","v":""}]
[null,"Moneda",null,null,null,null,null,"Nodo receptor"]
[null,"Tipo de cambio",null,null,null,null,null,"RFC"]
[null,"Tipo de comprobante",null,{"$f":"IF(C13=\"N\",\"Obligatorio complemento de nómina\",IF(C13=\"P\",\"Obligatorio complemento de pago\",\"\"))","v":""},null,null,null,"Nombre"]
[null,"Exportación",null,{"$f":"IFERROR(VLOOKUP(C14,CATALOGO!$B$40:$C$43,2,FALSE),\"\")","v":""},null,null,null,"Domicilio fiscal"]
[null,"Lugar de expedición",null,null,null,null,null,"Residencia fiscal"]
{"$rows_left_out":33}
{"sheet":"CAMPOS","index":3,"n_rows":86,"n_cols":8,"rows_kept":86,"cut":false,"hidden":true,"merged":[[43,1,43,4],[54,1,54,6],[37,7,38,7],[45,7,46,7],[5,1,5,3],[9,1,9,5],[14,1,14,5],[21,2,21,3],[20,2,20,3],[22,2,22,3],[23,2,23,3],[24,2,24,3],[25,2,25,3],[35,1,35,4],[70,1,70,6],[71,1,71,6],[72,1,72,6],[60,1,60,3],[63,1,63,4]]}
[]
[]
[]
[null,"1. Nodo Comprobante (atributos generales)"]
[null,"Atributo","Anexo 20","Guía del SAT","Uso","Tipo de campo","Matriz de error","Fundamento"]
[null,"Artículo 6o CFF.- Las contribuciones se causan conforme se realizan las situaciones jurídicas o de hecho, previstas en las leyes fiscales vigentes durante el lapso en que ocurran.\n\nDichas contribuciones se determinarán conforme a las disposiciones vigentes en el momento de su causación, pero les serán aplicables las normas sobre procedimiento que se expidan con posterioridad."]
[null,"• Version (4.0)","Atributo requerido con valor prefijado a 4.0 que indica la versión del estándar bajo el que se encuentra expresado el comprobante.","Debe tener el valor “4.0”.\nEste dato lo integra el sistema que utiliza el contribuyente para la emisión del comprobante fiscal.","Requerido","Alfanumérico"]
[null,"• Serie","Atributo opcional para precisar la serie para control interno del contribuyente. Este atributo acepta una cadena de caracteres.","Es el número de serie que utiliza el contribuyente para control interno de su información. Este campo acepta de uno hasta 25 caracteres alfanuméricos.","Opcional","Alfanumérico"]
[null,"• Folio","Atributo opcional para control interno del contribuyente que expresa el folio del comprobante, acepta una cadena de caracteres.","Es el folio de control interno que asigna el contribuyente al comprobante, puede conformarse desde uno hasta 40 caracteres alfanuméricos.","Opcional","Alfanumérico"]
[null,"Obligaciones de los proveedores en el proceso de certificación de CFDI\n2.7.2.9. Para los efectos de los artículos 29, segundo párrafo, fracción IV y 29 Bis del CFF, los proveedores de certificación de CFDI recibirán los comprobantes que envíen los contribuyentes, en los términos y mediante los procedimientos tecnológicos establecidos en el Anexo 20 que se publiquen en el Portal del SAT en la sección de “Factura Electrónica”.\nPara que un comprobante sea certificado y se le asigne un folio, adicionalmente a lo que establece el artículo 29, segundo párrafo, fracción IV, inciso a) del CFF, los proveedores de certificación de CFDI validarán que el documento cumpla con lo siguiente:\nI. Que el periodo entre la fecha de generación del documento y la fecha en la que se pretende certificar no exceda de 72 horas, o que dicho periodo sea menor a cero horas, esto lo validarán haciendo uso del huso horario correspondiente al Código Postal registrado en el campo LugarExpedicion, conforme al catálogo “CodigoPostal” del Anexo 20."]
[null,"• Fecha (fecha y hora de emisión)","Atributo requerido para la expresión de la fecha y hora de expedición del Comprobante Fiscal Digital por Internet. Se expresa en la forma AAAA-MM-DDThh:mm:ss y debe corresponder con la hora local donde se expide el comprobante.","Es la fecha y hora de expedición del comprobante fiscal. Se expresa en la forma AAAA-MM-DDThh:mm:ss y debe corresponder con la hora local donde se expide el comprobante.\nEste dato lo integra el sistema que utiliza el contribuyente para la emisión del comprobante fiscal.\nEjemplo:\nFecha= 2022-01-27T11:49:48","Requerido","tdCFDI:t_FechaH",1,"A"]
[null,"• Sello","Atributo requerido para contener el sello digital del comprobante fiscal, al que hacen referencia las reglas de resolución miscelánea vigente. El sello debe ser expresado como una cadena de texto en formato Base 64.","Es el sello digital del comprobante fiscal generado con el certificado de sello digital del contribuyente emisor del comprobante; éste funge como la firma del emisor del comprobante y lo integra el sistema que utiliza el contribuyente para la emisión del comprobante.","Requerido","Alfanumérico",2]
[null,"• FormaPago","Atributo condicional para expresar la clave de la forma de pago de los bienes o servicios amparados por el comprobante.","Se debe registrar la clave de la forma de pago de los bienes, la prestación de los servicios, el otorgamiento del uso o goce, o la forma en que se recibe el donativo contenidos en el comprobante.","Opcional","catCFDI:c_FormaPago",3,"B"]
[null,"• NoCertificado","Atributo requerido para expresar el número de serie del certificado de sello digital que ampara al comprobante, de acuerdo con el acuse correspondiente a 20 posiciones otorgado por el sistema del SAT.","Es el número que identifica al certificado de sello digital del emisor, el cual lo incluye en el comprobante fiscal el sistema que utiliza el contribuyente para la emisión.","Requerido","Alfanumérico"]
[null,"Artículo 29 segundo párrafo CFF\nLos contribuyentes a que se refiere el párrafo anterior deberán cumplir con las obligaciones siguientes:\n\nI.\tContar con un certificado de firma electrónica avanzada vigente, tener obligaciones fiscales en el Registro Federal de Contribuyentes y cumplir con los requisitos que determine el Servicio de Administración Tributaria mediante las reglas de carácter general.\nFracción reformada DOF 12-11-2021\n\nII. \tTramitar ante el Servicio de Administración Tributaria el certificado para el uso de los sellos digitales.\n\n\tLos contribuyentes podrán optar por el uso de uno o más certificados de sellos digitales que se utilizarán exclusivamente para la expedición de los comprobantes fiscales mediante documentos digitales. El sello digital permitirá acreditar la autoría de los comprobantes fiscales digitales por Internet que expidan las personas físicas y morales, el cual queda sujeto a la regulación aplicable al uso de la firma electrónica avanzada.\n\n\tLos contribuyentes podrán tramitar la obtención de un certificado de sello digital para ser utilizado por todos sus establecimientos o locales, o bien, tramitar la obtención de un certificado de sello digital por cada uno de sus establecimientos. El Servicio de Administración Tributaria establecerá mediante reglas de carácter general los requisitos de control e identificación a que se sujetará el uso del sello digital de los contribuyentes.\n\n\tLa tramitación de un certificado de sello digital sólo podrá efectuarse mediante formato electrónico que cuente con la firma electrónica avanzada de la persona solicitante."]
{"$rows_left_out":72}
{"sheet":"MATRIZE","index":4,"n_rows":130,"n_cols":6,"rows_kept":130,"cut":false,"hidden":true,"merged":[[0,0,0,5]]}
["Matriz de códigos de error para el Comprobante fiscal digital por Internet. Versión 4.0"]
["NÚM","ELEMENTO","ATRIBUTO","VALIDACIÓN","CÓDIGO ERROR","DESCRIPCIÓN DE CÓDIGO DE ERROR"]
[1,"Comprobante","Fecha","Este debe cumplir con el patrón (20[1-9][0-9])-(0[1-9]|1[0-2])-(0[1-9]|[12][0-9]|3[01])T(([01][0-9]|2[0-3]):[0-5][0-9]:[0-5][0-9]) y debe corresponder con la hora local donde se expide el comprobante.","CFDI40101","El campo Fecha no cumple con el patrón requerido.\n"]
[2,"Comprobante","Sello","Desencriptar el contenido de este atributo usando el certificado incluido en el atributo \"Certificado\". Generar la cadena original del comprobante. Aplicar el algoritmo de digestión SHA-256. El resultado de la digestión debe ser igual al resultado de la desencripción del sello.","CFDI40102","El resultado de la digestión debe ser igual al resultado de la desencripción del sello."]
[3,"Comprobante","FormaPago","Atributo condicional para expresar la clave de la forma de pago de los bienes o servicios amparados por el comprobante.","CFDI40103","Si existe el tipo de comprobante T, N o P el campo FormaPago no debe existir."]
[4,"Comprobante","FormaPago","Este atributo, debe contener un valor del catálogo c_FormaPago.","CFDI40104","El campo FormaPago no contiene un valor del catálogo c_FormaPago. "]
[5,"Comprobante","FormaPago","Este atributo debe contener el valor “99” cuando el atributo MetodoPago contenga el valor “PPD”.","CFDI40105","El campo FormaPago no contiene el valor \"99\". "]
[6,"Comprobante","Certificado","El atributo debe contener un archivo .cer válido.","CFDI40106","EL certificado no cumple con alguno de los valores permitidos."]
[7,"Comprobante","SubTotal","El valor de este atributo debe tener hasta la cantidad de decimales que soporte la moneda.","CFDI40107","El valor de este campo SubTotal excede la cantidad de decimales que soporta la moneda."]
[8,"Comprobante","SubTotal","Cuando el TipoDeComprobante sea I, E o N, el importe registrado en el atributo debe ser igual al redondeo de la suma de los importes de los conceptos registrados.","CFDI40108","El TipoDeComprobante es I,E o N, el importe registrado en el campo no es igual al redondeo de la suma de los importes de los conceptos registrados."]
[9,"Comprobante","SubTotal","Si el comprobante es T o P el importe debe ser 0, o cero con decimales.","CFDI40109","El TipoDeComprobante es T o P y el importe no es igual a 0, o cero con decimales."]
[10,"Comprobante","Descuento","El valor registrado debe ser menor o igual que el atributo Subtotal.","CFDI40110","El valor registrado en el campo Descuento no es menor o igual que el campo Subtotal."]
[11,"Comprobante","Descuento","Cuando el TipoDeComprobante sea I, E o N y algún concepto incluya el atributo Descuento, debe existir este atributo y debe ser igual al redondeo de la suma de los atributos Descuento registrados en los conceptos; en otro caso se debe omitir este atributo.","CFDI40111","El TipoDeComprobante no es I,E o N, y un concepto incluye el campo descuento. "]
[12,"Comprobante","Descuento","El valor de este atributo debe tener hasta la cantidad de decimales que soporte la moneda.","CFDI40112","El valor del campo Descuento excede la cantidad de decimales que soporta la moneda."]
[13,"Comprobante","Moneda","Este atributo, debe contener un valor del catálogo c_Moneda.","CFDI40113","El campo Moneda no contiene un valor del catálogo c_Moneda. "]
{"$rows_left_out":116}
{"sheet":"DISPO","index":5,"n_rows":95,"n_cols":5,"rows_kept":95,"cut":false,"hidden":true,"merged":[[78,2,78,3],[79,2,79,3],[80,2,80,3],[68,2,68,3],[72,2,72,3],[73,2,73,3],[74,2,74,3],[75,2,75,3],[77,2,77,3],[67,2,67,3],[53,2,53,3],[54,2,54,3],[55,2,55,3],[56,2,56,3],[57,2,57,3],[61,2,61,3],[62,2,62,3],[63,2,63,3],[64,2,64,3],[65,2,65,3],[66,2,66,3],[52,2,52,3],[36,2,36,3],[37,2,37,3],[38,2,38,3],[39,2,39,3],[40,2,40,3],[41,2,41,3],[42,2,42,3],[45,2,45,3],[46,2,46,3],[47,2,47,3],[48,2,48,3],[32,2,32,3],[19,2,19,3],[20,2,20,3],[21,2,21,3],[22,2,22,3],[23,2,23,3],[24,2,24,3],[25,2,25,3],[26,2,26,3],[29,2,29,3],[30,2,30,3],[31,2,31,3],[2,1,2,4],[14,2,14,3],[15,2,15,3],[10,1,10,4],[18,2,18,3],[4,1,4,4],[11,2,11,3],[12,2,12,3],[13,2,13,3],[94,2,94,3],[86,2,86,3],[85,2,85,3],[89,2,89,3],[90,2,90,3],[93,2,93,3]]}
[]
[]
[null,"Artículo 29-A CFF. Los comprobantes fiscales digitales a que se refiere el artículo 29 de este Código, deberán contener los siguientes requisitos:\n\nIII.\tEl lugar y fecha de expedición"]
[]
[null,"Relación de la fecha de expedición respecto los ingresos acumulables y las deducciones autorizadas\n\nPersona moral régimen general de Ley"]
[null,"Fracción / artículo 17 LISR","Supuesto","Momento de acumulación del ingreso","Comentario / Ejemplo"]
[null,"I","Regla general para enajenación de bienes, prestación de servicios","Cuando ocurra primero: • Se cobre total o parcialmente el precio • Se expida el CFDI que ampare el ingreso • Se entregue materialmente el bien o se preste el servicio","Si se factura antes del cobro, la fecha de expedición del CFDI determina el ingreso."]
[null,"I","Operaciones a crédito","Cuando se expida el comprobante fiscal o cuando sea exigible el pago, lo que ocurra primero","Ejemplo: venta a crédito a 90 días; si el CFDI se emite el día de la venta, ese día se acumula."]
[null,"II","Arrendamiento o uso temporal de bienes","Cuando se cobre o sea exigible la renta, o se expida el CFDI, lo que ocurra primero","Aplica a arrendadores de inmuebles."]
[]
[null,"Requisitos de las deducciones (PMRGL artículo 27 fracción XVIII LISR)"]
[null,"Tema / Requisito","Contenido principal",null,"Interpretación práctica"]
[null,"Plazo para reunir requisitos","Las operaciones deben cumplir a más tardar el último día del ejercicio con los requisitos que establece la Ley para cada deducción.",null,"Todas las deducciones deben contar con la documentación y condiciones fiscales antes de cerrar el ejercicio fiscal."]
[null,"Comprobante fiscal (fracc. III)","El CFDI debe obtenerse a más tardar el día en que se presente la declaración del ejercicio. Y la fecha de expedición de un gasto deducible debe corresponder al ejercicio en que se deduce.",null,"Si la factura se emite después, no será deducible."]
[null,"Fecha de expedición de CFDI","La fecha de expedición del comprobante fiscal de un gasto deducible debe corresponder al ejercicio en que se efectúa la deducción.",null,"Impide deducir gastos con facturas emitidas en un ejercicio posterior."]
{"$rows_left_out":81}
{"sheet":"OTROS","index":6,"n_rows":167,"n_cols":6,"rows_kept":167,"cut":false,"hidden":true,"merged":[[138,2,138,5],[144,2,144,5],[145,2,145,5],[139,2,139,5],[140,2,140,5],[141,2,141,5],[142,2,142,5],[143,2,143,5],[133,2,133,5],[134,2,134,5],[135,2,135,5],[136,2,136,5],[137,2,137,5],[128,2,128,5],[129,2,129,5],[130,2,130,5],[131,2,131,5],[132,2,132,5],[88,3,88,9],[89,3,89,9],[90,3,90,9],[91,3,91,9],[124,2,124,5],[40,1,40,12],[28,1,28,12],[31,1,31,7],[3,1,3,12],[6,1,6,12],[9,1,9,12],[20,1,20,12],[23,1,23,12],[26,1,26,12],[35,1,35,12],[36,1,36,12],[37,1,37,12],[38,1,38,12],[39,1,39,12],[86,1,86,2],[87,1,87,2],[88,1,88,2],[43,1,43,12],[44,1,44,12],[45,1,45,12],[84,1,84,2],[85,1,85,2],[85,3,85,9],[84,3,84,9],[47,1,68,10],[70,1,78,10],[80,1,80,10],[81,1,81,10],[86,3,86,9],[87,3,87,9],[147,1,147,10],[149,1,149,10],[151,1,151,10],[152,1,152,10],[89,1,89,2],[90,1,90,2],[91,1,91,2],[122,2,122,5],[121,2,121,5],[123,2,123,5],[94,1,118,10],[92,3,92,9],[92,1,92,2],[125,2,125,5],[126,2,126,5],[127,2,127,5],[153,1,153,10],[156,2,156,4],[157,2,157,4],[158,2,158,4],[159,2,159,4],[165,2,165,4],[166,2,166,4],[155,2,155,4],[156,5,156,9],[157,5,166,9],[160,2,160,4],[161,2,161,4],[162,2,162,4],[163,2,163,4],[164,2,164,4]]}
[]
[]
[]
[null,"Artículo 29-A CFF. Los comprobantes fiscales digitales a que se refiere el artículo 29 de este Código, deberán contener los siguientes requisitos:\n\nVII. El importe total consignado en número o letra, conforme a lo siguiente:\nc)  Señalar la forma en que se realizó el pago, ya sea en efectivo, transferencias electrónicas de fondos, cheques nominativos o tarjetas de débito, de crédito, de servicio o las denominadas monederos electrónicos que autorice el Servicio de Administración Tributaria."]
[]
[null,"Guía de SAT"]
[null,"En el caso de que se haya recibido el pago de la contraprestación al momento de la emisión del comprobante fiscal, los contribuyentes deberán consignar en éste la clave vigente correspondiente a la forma en que se recibió el pago de conformidad con el catálogo c_FormaPago publicado en el Portal del SAT.\n\nEn este supuesto no se debe emitir adicionalmente un CFDI al que se le incorpore el “Complemento para recepción de pagos”, porque el comprobante ya está pagado."]
[]
[null,"Pago recibido con más de una forma de pago"]
[null,"En el caso de aplicar más de una forma de pago en una transacción, los contribuyentes deben incluir en este campo la clave vigente del catálogo c_FormaPago de la forma de pago con la que se liquida la mayor cantidad del pago. En caso de que se reciban distintas formas de pago con el mismo importe, el contribuyente debe registrar a su consideración una de las formas de pago con las que se recibió el pago de la contraprestación."]
[]
[null,"Ejemplo"]
[null,"Efectivo",null,250]
[null,"Tarjeta de crédito",null,980]
[null,"Tarjeta de debito",null,900]
{"$rows_left_out":153}
{"sheet":"OBJETO","index":7,"n_rows":157,"n_cols":6,"rows_kept":157,"cut":false,"hidden":true,"merged":[[145,1,151,12],[9,0,10,0],[81,2,81,5],[82,3,86,3],[82,4,84,4],[133,1,140,12]]}
[]
[]
[null,"c_ObjetoImp","Descripción","Fecha inicio de vigencia","Fecha fin de vigencia"]
["①",1,"No objeto de impuesto.","2022-01-01"]
["②",2,"Sí objeto de impuesto.","2022-01-01"]
["③",3,"Sí objeto del impuesto y no obligado al desglose.","2022-01-01"]
["④",4,"Sí objeto del impuesto y no causa impuesto.","2022-10-07"]
["⑤",5,"Sí objeto del impuesto, IVA crédito PODEBI.","2023-12-06"]
["⑥",6,"Sí objeto del IVA, No traslado IVA.","2024-12-13"]
["⑦",7,"No traslado del IVA, Sí desglose IEPS.","2024-12-13"]
[null,8,"No traslado del IVA, No desglose IEPS.","2024-12-13"]
[]
["①"]
[]
[]
{"$rows_left_out":143}
{"sheet":"IVA","index":8,"n_rows":115,"n_cols":4,"rows_kept":115,"cut":false,"hidden":true,"merged":[[54,1,54,3],[5,1,5,3],[7,1,7,3],[28,1,28,3],[20,1,20,3],[24,1,24,3],[41,1,41,3],[42,1,42,3],[43,1,43,3],[44,1,44,3],[45,1,45,3],[46,1,46,3]]}
[]
[]
[null,"Tasa del 0% de IVA (artículo 2-A LIVA)"]
[]
[null,"Fracción / Inciso","Acto o actividad","Notas / Excepciones"]
[null,"Artículo 6 RLIVA. Para los efectos del artículo 2o.-A, fracción I, inciso a) de la Ley, se considera que los animales y vegetales no están industrializados por el simple hecho de que se presenten cortados, aplanados, en trozos, frescos, salados, secos, refrigerados, congelados o empacados ni los vegetales por el hecho de que sean sometidos a procesos de secado, limpiado, descascarado, despepitado o desgranado.\n\nLa madera cortada en tablas, tablones o en cualquier otra manera que altere su forma, longitud y grosor naturales, se considera sometida a un proceso de industrialización."]
[null,"I a)","Enajenación de animales y vegetales no industrializados","Excepto hule, perros, gatos y pequeñas especies mascotas. La madera en trozo no se considera industrializada."]
[null,"Artículo 7 RLIVA. Para los efectos del artículo 2o.-A, fracción I, inciso b) de la Ley, se consideran medicinas de patente las especialidades farmacéuticas, los estupefacientes, las substancias psicotrópicas y los antígenos o vacunas, incluyendo las homeopáticas y las veterinarias.\n\nLos medicamentos magistrales y oficinales a que se refiere la legislación sanitaria se consideran medicinas de patente, cuando sean equivalentes a las especialidades farmacéuticas."]
[null,"Tipo de medicamento","Definición","Tratamiento fiscal (IVA)"]
[null,"Especialidades farmacéuticas","Medicamentos elaborados industrialmente, con registro sanitario y presentación comercial.","Gravados a tasa 0% de IVA conforme al art. 2-A fr. I b) LIVA."]
[null,"Estupefacientes","Sustancias controladas con fines terapéuticos (ej. morfina, codeína).","Tasa 0% IVA."]
[null,"Sustancias psicotrópicas","Medicamentos que actúan sobre el sistema nervioso central (ansiolíticos, antidepresivos, etc.).","Tasa 0% IVA."]
[null,"Antígenos y vacunas","Productos biológicos que previenen enfermedades, incluidas vacunas veterinarias.","Tasa 0% IVA."]
[null,"Medicinas homeopáticas","Medicamentos elaborados bajo la práctica homeopática reconocida por la legislación sanitaria.","Tasa 0% IVA."]
[null,"Medicinas veterinarias","Medicamentos aplicados en animales para prevención o tratamiento de enfermedades.","Tasa 0% IVA."]
{"$rows_left_out":101}
{"sheet":"RETENCION","index":9,"n_rows":17,"n_cols":7,"rows_kept":17,"cut":false,"hidden":true,"merged":[[3,1,3,6],[4,1,4,6],[5,1,5,6]]}
[]
[]
[]
[null,"Artículo 27 LISR. Las deducciones autorizadas en este Título deberán reunir los siguientes requisitos:"]
[null,"V. Cumplir con las obligaciones establecidas en esta Ley y las demás disposiciones fiscales en materia de retención y entero de impuestos a cargo de terceros o que, en su caso, se recabe de éstos copia de los documentos en que conste el pago de dichos impuestos. Tratándose de pagos al extranjero, éstos sólo se podrán deducir siempre que el contribuyente proporcione la información a que esté obligado en los términos del artículo 76 de esta Ley.\n.........................."]
[null,"VI. Que cuando los pagos cuya deducción se pretenda realizar se hagan a contribuyentes que causen el impuesto al valor agregado, dicho impuesto se traslade en forma expresa y por separado en el comprobante fiscal correspondiente. Asimismo, deberán cumplir con la obligación de retención y entero del impuesto al valor agregado que, en su caso, se establezca en la Ley de la materia.\n................................."]
[]
[null,"Impuesto","Supuesto / Concepto","Quién retiene (PM)","A quién se retiene","Tasa / Monto","Fundamento legal"]
[null,"ISR","Honorarios a personas físicas con servicios independientes","PM que pagan","Personas físicas","Retención del 10% sobre el monto del pago","LISR, art. 106 "]
[null,"ISR","Arrendamiento de inmuebles","PM arrendatarias","Personas físicas arrendadoras","Retención del 10% sobre el monto del pago","LISR, art. 116"]
[null,"ISR","Enajenación, servicios, uso o goce","Persona moral","Personas físicas RESICO","Retención del 1.25% sobre el monto del pago","LISR, art. 1123-J"]
[null,"IVA","Servicios personales independientes (honorarios)","PM que pagan","Personas físicas","Retención de 2/3 del IVA trasladado (equivale a 10.6666667%)","LIVA, art. 1-A, fr. II inciso a), 3 RLIVA"]
[null,"IVA","Arrendamiento de inmuebles","PM arrendatarias","Personas físicas arrendadoras","Retención de 2/3 del IVA trasladado (equivale a 10.6666667%)","LIVA, art. 1-A, fr. II inciso a), 3 RLIVA"]
[null,"IVA","Adquieran desperdicios para ser utilizados como insumo de su actividad industrial o para su comercialización.","Persona moral","Persona físio o moral","Retención del 100% del IVA causado","LIVA, art. 1-A, fr. II inciso b)"]
[null,"IVA","Autotransporte terrestre de bienes prestado por personas físicas o morales","PM que pagan","Prestadores de servicio","Retención de 4% del IVA trasladado","LIVA, art. 1-A, fr. II inciso c)"]
{"$rows_left_out":3}
{"sheet":"CATALOGO","index":10,"n_rows":95,"n_cols":10,"rows_kept":95,"cut":false,"hidden":true,"merged":[[48,7,49,7],[48,8,49,8],[48,9,49,9]]}
[]
[]
[null,"c_FormaPago","Descripción","Bancarizado",null,"C_UnidadMedida","Descripción"]
[null,"01","Efectivo","No",null,"01","KILO  "]
[null,"02","Cheque nominativo","Sí",null,"02","GRAMO  "]
[null,"03","Transferencia electrónica de fondos","Sí",null,"03","METRO LINEAL  "]
[null,"04","Tarjeta de crédito","Sí",null,"04","METRO CUADRADO  "]
[null,"05","Monedero electrónico","Sí",null,"05","METRO CUBICO  "]
[null,"06","Dinero electrónico","Sí",null,"06","PIEZA  "]
[null,"08","Vales de despensa","No",null,"07","CABEZA  "]
[null,12,"Dación en pago","No",null,"08","LITRO  "]
[null,13,"Pago por subrogación","No",null,"09","PAR  "]
[null,14,"Pago por consignación","No",null,10,"KILOWATT  "]
[null,15,"Condonación","No",null,11,"MILLAR  "]
[null,17,"Compensación","No",null,12,"JUEGO  "]
{"$rows_left_out":80}