{"text_format":"1","workbook":"xlsx","n_sheets":18,"sheets":["PORTADA","MENU","NOMINA","ANIVERSARIO","FSBC","SBC","DSDI","RIMSS","RISR_IMSS","EMISIONM","EMISIONB","RESUMEN IMSS","CEDULA","TARIFA","GENERALES1","GENERAL","CATALOGO","c_Estado"],"not_rendered":{"charts":0,"images":20,"macros":1,"external_links":0,"defined_names":38,"comments":2,"pivot_tables":0},"unopened":[],"bounds":{"document_bytes":16777216,"sheet_cells":100000,"rows_first":2000,"rows_last":500,"rows_between":2000,"halvings":0,"cell_chars":16384,"cell_head_chars":4096},"cells_cut":0,"cells_raw":0,"read":"whole","date_system":"1900"}

{"sheet":"PORTADA","index":0,"n_rows":93,"n_cols":18,"rows_kept":93,"cut":false,"hidden":false,"merged":[[1,1,10,9],[11,1,11,9],[12,1,26,9]]}
[]
[null,14896532]
[]
[]
[]
[]
[]
[]
[]
[]
[]
[null,"www.acfmsc.com"]
[null,14896532]
[]
[]
{"$rows_left_out":79}
{"sheet":"MENU","index":1,"n_rows":18,"n_cols":3,"rows_kept":18,"cut":false,"hidden":true,"merged":[]}
[]
[]
[]
[]
[null,"Descripción","Nombre de la hoja"]
[null,"Importar XML de nómina","NOMINA"]
[null,"Determinación del aniversario del trabajador","ANIVERSARIO"]
[null,"Disposiciones para determinar el SBC","FSBC"]
[null,"Determinación del salario base de cotización","SBC"]
[null,"Determinación del salario diario integrado","SDI"]
[null,"Determinación de la retención del IMSS","RIMSS"]
[null,"Retención de ISR e IMSS","RISR_IMSS"]
[null,"Determinación de la cuota obrero patronal MENSUAL","EMISIONM"]
[null,"Determinación de la cuota obrero patronal BIMESTRAL","EMISIONB"]
[null,"Resumen cuotas obrego patronales","RESUMEN IMSS"]
{"$rows_left_out":4}
{"sheet":"NOMINA","index":2,"n_rows":5,"n_cols":72,"rows_kept":5,"cut":false,"hidden":true,"merged":[[3,51,3,52],[3,53,3,56],[3,57,3,61],[3,62,3,66],[3,67,3,69]]}
[null,null,null,null,null,null,null,null,null,null,null,null,null,null,null,null,null,null,null,null,null,null,null,null,null,null,null,null,null,{"$f":"IF(AND(AA6>=2,AA6<=4,AE6>=1,AE6<=8),0,1)","v":1}]
[]
[]
[null,null,null,null,null,null,null,null,null,null,null,null,null,null,null,null,null,null,null,null,null,null,null,null,null,null,null,null,null,null,null,null,null,null,null,null,null,null,null,null,null,null,null,null,null,null,null,null,null,null,null,"Venta acciones",null,"Tiempo extra",null,null,null,"Jubilaciones, pensiones, retiro",null,null,null,null,"Pagos por separación",null,null,null,null,"Incapacidades"]
[null,"Fecha de emisión","Fecha de timbrado","UUID","Concepto","Serie","Folio","Forma de pago","Metodo de pago","Moneda","Registro patronal","Nombre del patron","Riesgo de puesto","Concepto riesgo de puesto (este dato no pertenece al XML)","No. De empleado","Nombre del empleado","Departamento","Puesto","Clave de la entidad federrativa","Estado (este dato no pertenece al XML)","CURP","RFC","No. SS","Fecha inicio relación laboral","Salario diario integrado","Salario base de cotización","Tipo de regimen","Tipo de régimen (este dato no pertenece al XML)","Tipo de jornada","Tipo de jornada (este dato no pertenece al XML)","Tipo de contrato","Tipo de contrato (este dato no pertenece al XML)","Antigüedad","Fecha inicial pago","Fecha final pago","Fecha de pago","Periodicidad de pago","Periodicidad de pago  (este dato no pertenece al XML)","Clave de percepción","Percepción","Percepción de acuerdo al catálogo del SAT  (este dato no pertenece al XML)","Percepción exenta","Percepción gravado","Clave de deducción","Deducción","Deducción de acuerdo al catálogo del SAT  (este dato no pertenece al XML)","Importe deducción","Total del comprobante","Tipo de relación","UUID tipo de relación","Subsidio al empleo causado","Valor de mercado","Precio al otorgarse","Días","Tipo de horas","Horas extras","Importe pagado","Total en una sola exhibición","Total parcialidad","Monto diario","Ingreso acumulable","Ingreso no acumulable","Total pagado","No. de años de servicio","Último sueldo mensual ordinario","Ingreso acumulable","Ingreso no acumulable","Días de incapacidad","Tipo de incapacidad","Importe monetario","Dìas pagados","Ruta"]

{"sheet":"ANIVERSARIO","index":3,"n_rows":10,"n_cols":8,"rows_kept":10,"cut":false,"hidden":true,"merged":[[9,7,9,9]]}
[]
[null,"Determinación del factor de integración en partes fijas (antes de generar el reporte capture información en las celdas y columnas de color verde)"]
[]
[null,"Fecha inicial de pago"]
[null,"Fecha final de pago"]
[null,"Fecha de cálculo del aniversario"]
[null,"Días de aguinaldo"]
[null,"% Prima vacacional"]
[]
[null,null,null,null,null,null,null,"Factor de integración"]

{"sheet":"FSBC","index":4,"n_rows":29,"n_cols":7,"rows_kept":29,"cut":false,"hidden":true,"merged":[[19,1,19,4],[20,1,20,4],[1,1,1,2],[11,1,11,4],[12,1,12,4],[13,1,13,4],[14,1,14,4],[18,1,18,4],[6,1,6,5],[7,1,7,4],[8,1,8,4],[9,1,9,4],[10,1,10,4],[24,1,24,4],[25,1,25,4],[26,1,26,4],[27,1,27,4],[28,1,28,5]]}
[]
[null,"Solo capture información en las celdas de color verde"]
[]
[]
[null,null,null,null,"Valor de la UMA",117.31]
[null,null,null,null,"Salario diario del trabajador",380]
[null,"Artículo 27 LSS. El salario base de cotización se integra con los pagos hechos en efectivo por cuota diaria, gratificaciones, percepciones, alimentación, habitación, primas, comisiones, prestaciones en especie y cualquiera otra cantidad o prestación que se entregue al trabajador por su trabajo. Se excluyen como integrantes del salario base de cotización, dada su naturaleza, los siguientes conceptos:"]
[null,"I.  Los instrumentos de trabajo tales como herramientas, ropa y otros similares",null,null,null,"https://dof.gob.mx/nota_detalle.php?codigo=5721189&fecha=22/03/2024#gsc.tab=0"]
[null,"II. El ahorro, cuando se integre por un depósito de cantidad semanaria, quincenal o mensual igual del trabajador y de la empresa; si se constituye en forma diversa o puede el trabajador retirarlo más de dos veces al año, integrará salario; tampoco se tomarán en cuenta las cantidades otorgadas por el patrón para fines sociales de carácter sindical."]
[null,"Artículo 93 LISR. No se pagará el impuesto sobre la renta por la obtención de los siguientes ingresos:\nXI. Los provenientes de cajas de ahorro de trabajadores y de fondos de ahorro establecidos por las empresas para sus trabajadores cuando reúnan los requisitos de deducibilidad del Título II de esta Ley o, en su caso, del presente Título.\n\nRequisitos.\nQue sean otorgados en forma general a todos los trabajadores\nEl monto del patrón tiene que ser igual a la aportación de los trabajadores\nNo exceder del 13% del salario del trabajador\nCon un límite del 1.3 veces del valor de la UMA elevada al año\nFundamento: Artículo 27 fracción XI LISR"]
[null,"III. Las aportaciones adicionales que el patrón convenga otorgar a favor de sus trabajadores por concepto de cuotas del seguro de retiro, cesantía en edad avanzada y vejez."]
[null,"IV. Las cuotas que en términos de esta Ley le corresponde cubrir al patrón, las aportaciones al Instituto del Fondo Nacional de la Vivienda para los Trabajadores, y las participaciones en las utilidades de la empresa;",null,null,null,"https://dof.gob.mx/nota_detalle.php?codigo=5694775&fecha=07/07/2023#gsc.tab=0"]
[null,"Artículo 36 LSS. Corresponde al patrón pagar íntegramente la cuota señalada para los trabajadores, en los casos en que éstos perciban como cuota diaria el salario mínimo."]
[null,"Artículo 29 LINFONAVIT.- Son obligaciones de los patrones: \nII.- Determinar el monto de las aportaciones del cinco por ciento sobre el salario de los trabajadores a su servicio y efectuar el pago en las entidades receptoras que actúen por cuenta y orden del \nInstituto, para su abono en la subcuenta de vivienda de las cuentas individuales de los trabajadores previstas en los sistemas de ahorro para el retiro, en los términos de la presente \nLey y sus reglamentos, así como en lo conducente, conforme a lo previsto en la Ley del Seguro Social y en la Ley Federal del Trabajo. En lo que corresponde a la integración y cálculo de la \nbase y límite superior salarial para el pago de aportaciones, se aplicará lo contenido en la Ley del Seguro Social. \n\nEstas aportaciones son gastos de previsión de las empresas y forman parte del patrimonio de los trabajadores.\n......................................"]
[null,"V. La alimentación y la habitación cuando se entreguen en forma onerosa a los trabajadores; se entiende que son onerosas estas prestaciones cuando el trabajador pague por cada una de ellas, como mínimo, el veinte por ciento del salario mínimo general diario que rija en el Distrito Federal",null,null,null,{"$f":"IF(F5<>\"\",\"Se debe de cobrar por lo menos $\"&ROUND(F5*0.2,2),\"\")","v":"Se debe de cobrar por lo menos $23.46"},"https://dof.gob.mx/nota_detalle.php?codigo=5733018&fecha=11/07/2024#gsc.tab=0"]
{"$rows_left_out":15}
{"sheet":"SBC","index":5,"n_rows":88,"n_cols":10,"rows_kept":88,"cut":false,"hidden":true,"merged":[[19,1,19,2],[4,1,4,8],[8,1,8,8],[10,1,10,2],[11,1,11,2],[12,1,12,2],[13,1,13,2],[14,1,14,2],[15,1,15,2],[16,1,16,2],[17,1,17,2],[18,1,18,2],[29,1,29,2],[47,2,47,3],[68,2,68,3],[21,1,21,3],[23,1,23,2],[24,1,24,2],[25,1,25,2],[27,1,27,2],[28,1,28,2]]}
[]
[]
[]
[]
[null,"Plantilla para Determinar el Salario Base de Cotización (SBC) - México"]
[]
[null,"Fecha de cálculo"]
[]
[null,"1) Entradas (editar celdas con relleno de color verde)"]
[]
[null,"Fecha de ingreso",null,null,null,"Otras prestaciones fijas prviamente conocidas"]
[null,"Fecha de cálculo",null,null,null,null,"Patrón","Trabajador"]
[null,"Días devengados del bimestre a cálcular (en su caso)",null,null,null,"% Fondo de ahorro",null,null,{"$f":"IFERROR(IF(G13=H13,\"No integra al SBC\",\"Integra $\"&ROUND(D14*G13,2)),\"\")","v":"No integra al SBC"}]
[null,"Salario diario pactado (SD)",null,null,null,"Habitación",null,{"$f":"IF(G14=\"Sí\",\"Cobro al trabajador\",\"\")","v":""},null,{"$f":"IFERROR(IF(H14<>\"\",IF(I14>=ROUND(D20*0.2,2),\"No integra\",\"Integra \"&TEXT(0.25,\"0%\")&\" del salario\"),\"\"),\"\")","v":""}]
[null,"Aguinaldo (días por año)",null,null,null,"Alimentación que se otorga",null,{"$f":"IFERROR(IF(G15<>\"\",\"Cobro al trabajador\",\"\"),\"\")","v":""},20]
{"$rows_left_out":74}
{"sheet":"DSDI","index":6,"n_rows":59,"n_cols":7,"rows_kept":59,"cut":false,"hidden":true,"merged":[[3,1,3,2],[13,1,14,2],[13,4,14,4],[57,1,58,2],[57,4,58,4]]}
[]
[]
[null,"Unidad de obra"]
[null,"Período de Trabajo",null,"Días Trabajados","Metros Cuadrados Instalados","Cuota por metro cuadrado","Percepción Total"]
[null,"2026-01-01","2026-01-07",{"$f":"IF(AND(B5<>\"\",C5<>\"\"),DATEDIF(B5,C5,\"D\")+1,\"\")","v":7},70,50,{"$f":"IFERROR(E5*F5,\"\")","v":3500}]
[null,{"$f":"C5+1","v":"2026-01-08"},{"$f":"C5+6","v":"2026-01-13"},{"$f":"IF(AND(B6<>\"\",C6<>\"\"),DATEDIF(B6,C6,\"D\")+1,\"\")","v":6},60,50,{"$f":"IFERROR(E6*F6,\"\")","v":3000}]
[null,{"$f":"C6+1","v":"2026-01-14"},{"$f":"B7+6","v":"2026-01-20"},7,80,50,4000]
[null,{"$f":"C7+1","v":"2026-01-21"},{"$f":"B8+6","v":"2026-01-27"},7,75,50,3750]
[null,{"$f":"C8+1","v":"2026-01-28"},"2026-01-30",3,65,50,3250]
[null,null,null,"",20,50,1000]
[null,"Totales",null,{"$f":"SUM(D5:D10)","v":30},null,null,{"$f":"SUM(G5:G10)","v":18500}]
[]
[]
[null,"Salario diario promedio",null,{"$f":"G11","v":18500},{"$f":"\"=      \"&IFERROR(ROUND(D14/D15,2),\"\")","v":"=      616.67"}]
[null,null,null,{"$f":"D11","v":30}]
{"$rows_left_out":45}
{"sheet":"RIMSS","index":7,"n_rows":43,"n_cols":10,"rows_kept":43,"cut":false,"hidden":true,"merged":[[14,3,14,4],[16,1,16,4],[18,1,18,6],[37,1,37,2],[40,1,40,3],[12,1,13,1],[12,3,12,4],[12,8,13,8],[13,3,13,4],[6,3,6,4],[7,8,10,8],[9,3,9,4],[10,3,10,4],[11,3,11,4]]}
[]
[]
[null,"Capture información en las celdas de color verde"]
[]
[]
[null,"Seguro y concepto","Prestaciones","Cuota Patrón","Tasa Patrón","Cuota Trabajador","Total","Base salarial","Fundamento legal"]
[null,"Riesgos de Trabajo","En especie y dinero","Conforme con su siniestralidad laboral",null,0,"Prima correspondiente","Salario base de cotización (SBC)","Artículo 40, 70, 73 LSS y 24 RMACERF "]
[null,"Enfermedades y Maternidad","En especie","Cuota fija por cada colaborador hasta por tres Salarios Mínimos General Vigente (SMGV) en el DF",0.20399999999999999,0,0.20399999999999999,"UMA","Artículo 105, 106 Y 107 LSS"]
[null,"Enfermedades y Maternidad","En especie","Cuota adicional por la diferencia del SBC y de tres veces el valor de la UMA",1.0999999999999999E-2,4.0000000000000001E-3,1.4999999999999999E-2,"Diferencia entre el SBC y tres UMAS"]
[null,"Enfermedades y Maternidad","En dinero",7.0000000000000001E-3,null,2.5000000000000001E-3,9.4999999999999998E-3,"SBC"]
[null,"Enfermedades y Maternidad","Gastos médicos para pensionados y beneficiarios",1.0500000000000001E-2,null,3.7499999999999999E-3,1.43E-2,"SBC"]
[null,"Invalidez y Vida ","En especie y dinero ",1.7500000000000002E-2,null,6.3E-3,2.3800000000000002E-2,"SBC ","Artículo 112, 146 y 147 LSS"]
[null,"Retiro, Cesantía en Edad Avanzada y Vejez (CEAV) ","Retiro ",0.02,null,0,0.02,"SBC ","Artículo 152, 167 y 168 LSS"]
[null,null,"CEAV ","3.15% *",null,1.125E-2,4.2799999999999998E-2,"SBC "]
[null,"Guarderías y Prestaciones Sociales ","En especie ",0.01,null,0,0.01,"SBC ","Artículo 201, 211 y 212 LSS"]
{"$rows_left_out":29}
{"sheet":"RISR_IMSS","index":8,"n_rows":95,"n_cols":10,"rows_kept":95,"cut":false,"hidden":true,"merged":[[14,1,14,4],[51,1,51,2],[1,1,1,2],[61,1,61,6]]}
[]
[null,"Capture información en las celdas de color verde"]
[]
[null,"Año de cálculo"]
[null,"Mes de cálculo"]
[null,"Periodicidad de pago"]
[null,"Salario diario"]
[null,"Salario base de cotización"]
[null,"Zona del salario mínimo"]
[null,"Salario mínimo",{"$f":"IFERROR(VLOOKUP(C9,GENERALES1!$B$21:$C$22,2,FALSE),\"\")","v":""}]
[null,"Mes de la UMA"]
[null,"Valor de la UMA",{"$f":"IFERROR(VLOOKUP(C11,GENERALES1!$B$25:$C$26,2,FALSE),\"\")","v":""}]
[]
[]
[null,"V. Tarifa aplicable durante 2025 para el cálculo de los pagos provisionales mensuales a que se refieren los artículos 96 de la Ley del ISR y 175 de su Reglamento, así como la regla 3.12.2."]
{"$rows_left_out":81}
{"sheet":"EMISIONM","index":9,"n_rows":8,"n_cols":20,"rows_kept":8,"cut":false,"hidden":true,"merged":[[5,9,5,10],[5,11,5,12],[5,13,5,14],[5,16,5,17]]}
[]
[null,"Determinación de las cuotas obrero patronales mensuales"]
[null,null,"Año de cálculo "]
[null,null,"Mes "]
[null,null,"Valor de la UMA "]
[null,null,"Prima de riesgo ",null,null,null,null,null,null,"Enfermedad y maternidad excedente 3 veces el valor de la UMA",null,"Enfermedad y maternidad prestaciones en dinero",null,"Enfermedad y maternidad gastos médicos pensionados",null,null,"Invalidez y vida"]
[null,null,null,null,null,null,null,null,0.20399999999999999,1.0999999999999999E-2,4.0000000000000001E-3,7.0000000000000001E-3,2.5000000000000001E-3,1.0500000000000001E-2,3.7499999999999999E-3,null,1.7500000000000002E-2,6.2500000000000003E-3,0.01]
[null,"NSS","Nombre","Días del mes","Faltas","Incapacidades","Salario diario (opcional)","Salario base de cotización","Cuota Fija","Excedente Patronal","Excedente Obrero","Prestaciones en Dinero Patronal","Prestaciones en Dinero Obrero","Gastos Médicos y Pensionados Patronal","Gastos Médicos y Pensionados Obrero","Riesgos de Trabajo","Invalidez y Vida Patronal","Invalidez y Vida Obrero","Guarderías y Prestaciones Sociales","Total"]

{"sheet":"EMISIONB","index":10,"n_rows":9,"n_cols":19,"rows_kept":9,"cut":false,"hidden":true,"merged":[[6,9,6,10]]}
[]
[null,"Determinación de las cuotas obrero patronales bimestral"]
[null,null,"Año de cálculo "]
[null,null,"Bimestre "]
[null,null,"Salarío mínimo general de la zona "]
[null,null,"Valor de la UMA "]
[null,null,null,null,null,null,null,null,null,"Cesantía en Edad Avanzada y Vejez"]
[null,null,null,null,null,null,null,null,0.02,null,1.125E-2,null,0.05]
[null,"NSS","Nombre","Días del bimestre","Faltas","Incapacidades","Salario diario","Salario base de cotización","Retiro","Cesantía en Edad Avanzada y Vejez Patronal","Cesantía en Edad Avanzada y Vejez Obrero","Subtotal RCV","Aportación Patronal INFONAVIT","Tipo de Descuento","Valor de Descuento","Número de Crédito","Amortización","Subtotal Infonavit","Total"]

{"sheet":"RESUMEN IMSS","index":11,"n_rows":23,"n_cols":5,"rows_kept":23,"cut":false,"hidden":true,"merged":[]}
[]
[]
[]
[]
[null,"Resumen Emisión IMSS",null,null,"Resumen Emisión RCV"]
[]
[null,"Periodo Mensual",null,null,"Bimestre"]
[null,"Días",null,null,"Número de acreditados"]
[null,"Total Cotizantes IMSS"]
[null,"Prima de Riesgos de Trabajo",null,null,"Total Aportación Pat. Infonavit"]
[]
[null,"Cuota Fija",null,null,"Aportación Pat. S/C Infonavit"]
[null,"Excedente Patronal",null,null,"Aportación Pat. C/C Infonavit"]
[null,"Excedente Obrero",null,null,"Amortización"]
[null,"Prestaciones en Dinero Patronal",null,null,"Aport. Pat. C/C Det. Infonavit mas Amort."]
{"$rows_left_out":9}
{"sheet":"CEDULA","index":12,"n_rows":29,"n_cols":13,"rows_kept":29,"cut":false,"hidden":true,"merged":[]}
[]
[]
[null,"Determinación de diferencias (capture en las celdas de color verde los datos de las emisiones anticipadas)"]
[]
[]
[null,"Periodo al que corresponde",null,null,null,null,"Datos del cálculo manual",null,null,null,"Difetencias"]
[null,"Concepto","Patronal","Obrera","Suma",null,"Patronal","Obrera","Suma",null,"Patronal","Obrera","Suma"]
[null,"IMPORTE TOTAL"]
[null,"Cuota Fija"]
[null,"Excedente"]
[null,"Prestaciones en Dinero"]
[null,"Gastos Med. Pens. Art. 25"]
[null,"Riesgos de Trabajo"]
[null,"Invalidez y Vida Patronal"]
[null,"Guarderías y Prestaciones Sociales"]
{"$rows_left_out":15}
{"sheet":"TARIFA","index":13,"n_rows":207,"n_cols":10,"rows_kept":207,"cut":false,"hidden":true,"merged":[[5,1,5,4]]}
[]
[]
[]
[null,null,null,null,null,null,"Convertir a:",{"$f":"IF(RISR_IMSS!C6<>\"\",RISR_IMSS!C6,30)","v":30}]
[]
[null,"V. Tarifa aplicable durante 2026 para el cálculo de los pagos provisionales mensuales a que se refieren los artículos 96 de la Ley del ISR y 175 de su Reglamento, así como la regla 3.12.2."]
[null,"Límite inferior","Límite superior","Cuota fija","Por ciento para aplicarse sobre el excedente del límite inferior",null,"Límite inferior","Límite superior","Cuota fija","Por ciento para aplicarse sobre el excedente del límite inferior"]
[null,"$","$","$","%",null,"$","$","$","%"]
[null,0.01,844.59,0,1.92,null,0.01,{"$f":"IFERROR(IF($H$4<30,ROUND(C9/30.4*$H$4,2),C9),C9)","v":844.59},{"$f":"IFERROR(IF($H$4<30,ROUND(D9/30.4*$H$4,2),D9),D9)","v":0},1.92]
[null,844.6,7168.51,16.22,6.4,null,{"$f":"IFERROR(H9+0.01,H9)","v":844.6},{"$f":"IFERROR(IF($H$4<30,ROUND(C10/30.4*$H$4,2),C10),C10)","v":7168.51},{"$f":"IFERROR(IF($H$4<30,ROUND(D10/30.4*$H$4,2),D10),D10)","v":16.22},6.4]
[null,7168.52,12598.02,420.95,10.88,null,{"$f":"IFERROR(H10+0.01,H10)","v":7168.52},12598.02,420.95,10.88]
[null,12598.03,14644.64,1011.68,16,null,12598.03,14644.64,1011.68,16]
[null,14644.65,17533.64,1339.14,17.920000000000002,null,14644.65,17533.64,1339.14,17.920000000000002]
[null,17533.650000000001,35362.83,1856.84,21.36,null,17533.649999999998,35362.83,1856.84,21.36]
[null,35362.839999999997,55736.68,5665.16,23.52,null,35362.840000000004,55736.68,5665.16,23.52]
{"$rows_left_out":193}
{"sheet":"GENERALES1","index":14,"n_rows":32,"n_cols":4,"rows_kept":32,"cut":false,"hidden":true,"merged":[[4,1,4,3],[5,1,5,2],[19,1,19,2],[23,1,23,2]]}
[]
[]
[]
[]
[null,"Tabla de vacaciones para trabajadores de no buques (art. 76 LFT)"]
[null,"Años"]
[null,"Mínimo","Máximo","Días"]
[null,0,1,12]
[null,{"$f":"C8+0.01","v":1.01},2,{"$f":"D8+2","v":14}]
[null,{"$f":"C9+0.01","v":2.0099999999999998},3,{"$f":"D9+2","v":16}]
[null,3.01,4,18]
[null,4.01,5,20]
[null,5.01,{"$f":"C12+5","v":10},22]
[null,10.01,{"$f":"C13+5","v":15},24]
[null,15.01,20,26]
{"$rows_left_out":18}
{"sheet":"GENERAL","index":15,"n_rows":240,"n_cols":10,"rows_kept":240,"cut":false,"hidden":true,"merged":[[38,2,38,9],[60,1,60,3],[70,5,70,6]]}
[]
[]
[]
[null,"Enero",{"$f":"IFERROR(DAY(EOMONTH(DATE(EMISIONM!$D$3,ROW($A1),1),0)),\"\")","v":31}]
[null,"Febrero",{"$f":"IFERROR(DAY(EOMONTH(DATE(EMISIONM!$D$3,ROW($A2),1),0)),\"\")","v":28}]
[null,"Marzo",{"$f":"IFERROR(DAY(EOMONTH(DATE(EMISIONM!$D$3,ROW($A3),1),0)),\"\")","v":31}]
[null,"Abril",{"$f":"IFERROR(DAY(EOMONTH(DATE(EMISIONM!$D$3,ROW($A4),1),0)),\"\")","v":30}]
[null,"Mayo",{"$f":"IFERROR(DAY(EOMONTH(DATE(EMISIONM!$D$3,ROW($A5),1),0)),\"\")","v":31}]
[null,"Junio",{"$f":"IFERROR(DAY(EOMONTH(DATE(EMISIONM!$D$3,ROW($A6),1),0)),\"\")","v":30}]
[null,"Julio",{"$f":"IFERROR(DAY(EOMONTH(DATE(EMISIONM!$D$3,ROW($A7),1),0)),\"\")","v":31}]
[null,"Agosto",{"$f":"IFERROR(DAY(EOMONTH(DATE(EMISIONM!$D$3,ROW($A8),1),0)),\"\")","v":31}]
[null,"Septiembre",{"$f":"IFERROR(DAY(EOMONTH(DATE(EMISIONM!$D$3,ROW($A9),1),0)),\"\")","v":30}]
[null,"Octubre",{"$f":"IFERROR(DAY(EOMONTH(DATE(EMISIONM!$D$3,ROW($A10),1),0)),\"\")","v":31}]
[null,"Noviembre",{"$f":"IFERROR(DAY(EOMONTH(DATE(EMISIONM!$D$3,ROW($A11),1),0)),\"\")","v":30}]
[null,"Diciembre",{"$f":"IFERROR(DAY(EOMONTH(DATE(EMISIONM!$D$3,ROW($A12),1),0)),\"\")","v":31}]
{"$rows_left_out":226}
{"sheet":"CATALOGO","index":16,"n_rows":229,"n_cols":11,"rows_kept":229,"cut":false,"hidden":true,"merged":[]}
[]
[]
[]
[null,"c_RiesgoPuesto","Descripción","Fecha inicio de vigencia","Fecha fin de vigencia",null,null,"c_TipoPercepcion","Descripción","Fecha inicio de vigencia","Fecha fin de vigencia"]
[null,1,"Clase I","2017-01-01",null,null,null,1,"Sueldos, Salarios  Rayas y Jornales","2016-11-01"]
[null,2,"Clase II","2017-01-01",null,null,null,2,"Gratificación Anual (Aguinaldo)","2016-11-01"]
[null,3,"Clase III","2017-01-01",null,null,null,3,"Participación de los Trabajadores en las Utilidades PTU","2016-11-01"]
[null,4,"Clase IV","2017-01-01",null,null,null,4,"Reembolso de Gastos Médicos Dentales y Hospitalarios","2016-11-01"]
[null,5,"Clase V","2017-01-01",null,null,null,5,"Fondo de Ahorro","2016-11-01"]
[null,99,"No aplica","2017-08-13",null,null,null,6,"Caja de ahorro","2016-11-01"]
[null,null,null,null,null,null,null,9,"Contribuciones a Cargo del Trabajador Pagadas por el Patrón","2016-11-01"]
[null,null,null,null,null,null,null,10,"Premios por puntualidad","2016-11-01"]
[null,"c_TipoRegimen","Descripción","Fecha inicio de vigencia","Fecha fin de vigencia",null,null,11,"Prima de Seguro de vida","2016-11-01"]
[null,2,"Sueldos","2017-01-01",null,null,null,12,"Seguro de Gastos Médicos Mayores","2016-11-01"]
[null,3,"Jubilados","2017-01-01",null,null,null,13,"Cuotas Sindicales Pagadas por el Patrón","2016-11-01"]
{"$rows_left_out":215}
{"sheet":"c_Estado","index":17,"n_rows":100,"n_cols":6,"rows_kept":100,"cut":false,"hidden":true,"merged":[[0,0,0,2]]}
["Catálogo de estados. "]
["Versión CFDI","Versión catálogo","Revisión catálogo","Fecha publicación de catálogo","Fecha  inicio de vigencia del catálogo","Fecha fin de vigencia del catálogo"]
[4,1,0,0,"2022-01-01"]
[]
["c_Estado","c_Pais","Nombre del estado","Fecha inicio de vigencia","Fecha fin de vigencia"]
["AGU","MEX","Aguascalientes","2022-01-01"]
["BCN","MEX","Baja California","2022-01-01"]
["BCS","MEX","Baja California Sur","2022-01-01"]
["CAM","MEX","Campeche","2022-01-01"]
["CHP","MEX","Chiapas","2022-01-01"]
["CHH","MEX","Chihuahua","2022-01-01"]
["COA","MEX","Coahuila","2022-01-01"]
["COL","MEX","Colima","2022-01-01"]
["CMX","MEX","Ciudad de México","2022-01-01"]
["DUR","MEX","Durango","2022-01-01"]
{"$rows_left_out":85}