{"text_format":"1","workbook":"xlsx","n_sheets":13,"sheets":["PORTADA","MENU","FCFDI","RCFDI","CFDIP","TIPOS","FUNDAMENTO","FUNDAMENTOR","DESCRIPCIÓN","RETENCION","OBJETO","DATOS","CATALOGO"],"not_rendered":{"charts":0,"images":23,"macros":1,"external_links":0,"defined_names":7,"comments":2,"pivot_tables":0},"unopened":[],"bounds":{"document_bytes":16777216,"sheet_cells":100000,"rows_first":2000,"rows_last":500,"rows_between":2000,"halvings":0,"cell_chars":16384,"cell_head_chars":4096},"cells_cut":0,"cells_raw":0,"read":"whole","date_system":"1900"}

{"sheet":"PORTADA","index":0,"n_rows":325,"n_cols":16,"rows_kept":325,"cut":false,"hidden":false,"merged":[]}
[]
[]
[]
[]
[]
[]
[]
[]
[]
[]
[]
[]
[]
[]
[]
{"$rows_left_out":311}
{"sheet":"MENU","index":1,"n_rows":15,"n_cols":3,"rows_kept":15,"cut":false,"hidden":false,"merged":[]}
[]
[]
[]
[]
[]
[null,"DESCRIPCIÓN","NOMBRE DE LA HOJA"]
[null,{"$f":"IF(PORTADA!$E$80=87965236,\"Formato CFDI\",\"\")","v":"Formato CFDI"},{"$f":"IF(PORTADA!$E$80=87965236,HYPERLINK(\"#FCFDI!D6\",\"FCFDI\"),\"\")","v":"FCFDI"}]
[null,{"$f":"IF(PORTADA!$E$80=87965236,\"Importación XML en forma individual para su lectura\",\"\")","v":"Importación XML en forma individual para su lectura"},{"$f":"IF(PORTADA!$E$80=87965236,HYPERLINK(\"#RCFDI!C7\",\"RCFDI\"),\"\")","v":"RCFDI"}]
[null,{"$f":"IF(PORTADA!$E$80=87965236,\"Importación XML con complemento de pagos para su lectura\",\"\")","v":"Importación XML con complemento de pagos para su lectura"},{"$f":"IF(PORTADA!$E$80=87965236,HYPERLINK(\"#CFDIP!C7\",\"CFDIP\"),\"\")","v":"CFDIP"}]
[null,{"$f":"IF(PORTADA!$E$80=87965236,\"Tipo de CFDI\",\"\")","v":"Tipo de CFDI"},{"$f":"IF(PORTADA!$E$80=87965236,HYPERLINK(\"#TIPOS!B5\",\"TIPOS\"),\"\")","v":"TIPOS"}]
[null,{"$f":"IF(PORTADA!$E$80=87965236,\"Algunos fundamentos emisor del CFDI\",\"\")","v":"Algunos fundamentos emisor del CFDI"},{"$f":"IF(PORTADA!$E$80=87965236,HYPERLINK(\"#FUNDAMENTO!B6\",\"FUNDAMENTO\"),)","v":"FUNDAMENTO"}]
[null,{"$f":"IF(PORTADA!$E$80=87965236,\"Algunos fundamentos receptor del CFDI\",\"\")","v":"Algunos fundamentos receptor del CFDI"},{"$f":"IF(PORTADA!$E$80=87965236,HYPERLINK(\"#FUNDAMENTOR!C5\",\"FUNDAMENTOR\"),)","v":"FUNDAMENTOR"}]
[null,{"$f":"IF(PORTADA!$E$80=87965236,\"Datos adicionales del campo descripción\",\"\")","v":"Datos adicionales del campo descripción"},{"$f":"IF(PORTADA!$E$80=87965236,HYPERLINK(\"#DESCRIPCIÓN!B3\",\"DESCRIPCIÓN\"),)","v":"DESCRIPCIÓN"}]
[null,{"$f":"IF(PORTADA!$E$80=87965236,\"Fundamento de retención\",\"\")","v":"Fundamento de retención"},{"$f":"IF(PORTADA!$E$80=87965236,HYPERLINK(\"#RETENCION!B4\",\"RETENCION\"),)","v":"RETENCION"}]
[null,{"$f":"IF(PORTADA!$E$80=87965236,\"Ejemplos campo objeto del CFDI\",\"\")","v":"Ejemplos campo objeto del CFDI"},{"$f":"IF(PORTADA!$E$80=87965236,HYPERLINK(\"#OBJETO!C4\",\"OBJETO\"),)","v":"OBJETO"}]
{"$rows_left_out":1}
{"sheet":"FCFDI","index":2,"n_rows":58,"n_cols":11,"rows_kept":58,"cut":false,"hidden":false,"merged":[[37,1,37,9],[43,1,43,9],[3,1,3,3],[3,5,3,6],[3,8,3,9],[19,1,19,9],[23,1,23,9],[27,1,27,9],[9,2,10,2],[4,5,4,6],[4,1,4,3],[4,8,4,9],[21,4,21,6],[36,2,36,3]]}
[]
[null,null,null,null,null,null,null,{"$f":"IF(PORTADA!$E$80=87965236,HYPERLINK(\"#MENU!C7\",\"MENÚ\"),\"\")","v":"MENÚ"}]
[]
[null,"Nodo comprobante",null,null,null,"Nodo emisor",null,null,"Nodo receptor"]
[null,"Nodo comprobante",null,null,null,"Emisor",null,null,"Receptor"]
[null,{"$f":"IF(PORTADA!E80=87965236,FORMATO,\"\")","v":"Fecha de expedición *"},null,null,null,"RFC *",null,{"$f":"IFERROR(IF(ISERROR(VLOOKUP(G6,#REF!,1,FALSE))=FALSE,HYPERLINK(\"#LISTADO!B\"&MATCH(G6,#REF!,0),\"Ver listado\"),\"\"),\"\")","v":""},{"$f":"IF(PORTADA!E80=87965236,FORMATO1,\"\")","v":"RFC *"}]
[null,"Serie **",null,null,null,"Nombre *",null,null,"Nombre *"]
[null,"Folio **",null,null,null,"Régimen fiscal *",null,{"$f":"IFERROR(IF(AND(LEN(G6)=13,OR(G8=606,G8=612,G8=626)),HYPERLINK(\"#RETENCION!$B$4\",\"RETENCIÓN\"),\"\"),\"\")","v":""},"Domicilio fiscal del receptor *"]
[null," ",null,null,null,"FacAtrAdquirente ***",null,null,"Residencia fiscal ***"]
[null,"Forma de pago ***",null,null,null,null,null,null,"No. de registro tributario ***"]
[null,"Método de pago ***",null,null,null,null,null,null,"Régimen fiscal *",null,{"$f":"IFERROR(VLOOKUP(J11,CATALOGO!$B$12:$C$30,2,FALSE),\"\")","v":""}]
[null,"Moneda *",null,null,"",null,null,null,"Uso del CFDI *",null,{"$f":"IF(AND(J11<>\"\",J12<>\"\"),IF(ISERROR(FIND(J11,INDIRECT(\"CATALOGO!J\"&MATCH(J12,CATALOGO!$H:$H,0))))=FALSE,VLOOKUP(J12,CATALOGO!$H$51:$I$74,2,FALSE),\"No corresponde al régimen fiscal\"),\"\")","v":""}]
[null,"Tipo de cambio ***"]
[null,"Tipo de comprobante *",null,null,{"$f":"IFERROR(IF(TARI=\"670106&\",VLOOKUP(D14,TIPOS!$B$47:$C$51,2,FALSE),\"\"),\"\")","v":""}]
[null,"Exportación *",null,null,{"$f":"IFERROR(IF(TARI=\"670106&\",VLOOKUP(D15,CATALOGO!$B$6:$C$9,2,FALSE),\"\"),\"\")","v":""}]
{"$rows_left_out":44}
{"sheet":"RCFDI","index":3,"n_rows":51,"n_cols":69,"rows_kept":51,"cut":false,"hidden":false,"merged":[[25,1,25,2]]}
[null,null,null,null,null,null,null,null,null,null,null,null,null,null,null,null,null,null,null,null,null,null,null,null,null,null,null,null,null,null,null,null,null,null,null,null,null,null,null,null,null,null,null,null,null,null,null,null,null,null,null,null,null,null,40600,null,null,null,null,null,null,null,null,null,null,null,null,null,"C:\\Users\\Usuario\\Downloads\\PRUEBA\\d119b045-0652-4741-995a-5fac9f178024.xmld119b045-0652-4741-995a-5fac9f178024.xml"]
[]
[]
[]
[null,null,null,{"$f":"IF(PORTADA!$E$80=87965236,HYPERLINK(\"#MENU!C7\",\"MENÚ\"),\"\")","v":"MENÚ"}]
[]
[null,"Folio fiscal","430DC59B-8E45-4EEC-84CE-0FFCB3D7B6A1"]
[null,"Fecha de timbrado","2024-03-08T16:29:54"]
[null,"Fecha de emisión","2024-03-08T14:29:54"]
[null,"Tipo de comprobante","I","Ingreso"]
[null,"Exportación",1,"No aplica"]
[null,"Serie","POSM"]
[null,"Folio",5364611]
[null,"Forma de pago",4,"Tarjeta de crédito"]
[null,"Método de pago","PUE","Pago en una sola exhibición"]
{"$rows_left_out":37}
{"sheet":"CFDIP","index":4,"n_rows":45,"n_cols":67,"rows_kept":45,"cut":false,"hidden":false,"merged":[[25,1,25,2]]}
[]
[]
[]
[]
[]
[]
[null,"Folio fiscal"]
[null,"Fecha de timbrado",null,null,null,null,null,null,null,null,null,null,null,null,null,null,null,null,null,null,null,null,null,null,null,null,null,null,null,null,null,null,null,null,null,null,null,null,null,null,null,null,null,null,null,null,null,null,null,null,null,null,null,null,null,null,null,null,null,null,null,null,null,null,null,null,{"$f":"IFERROR(AS8-BA8-BE8+BI8+BM8,0)","v":0}]
[null,"Fecha de emisión"]
[null,"Tipo de comprobante"]
[null,"Exportación"]
[null,"Serie"]
[null,"Folio"]
[null,"Forma de pago"]
[null,"Método de pago"]
{"$rows_left_out":31}
{"sheet":"TIPOS","index":5,"n_rows":51,"n_cols":3,"rows_kept":51,"cut":false,"hidden":false,"merged":[[41,1,41,2],[42,1,42,2],[22,1,22,2],[19,1,19,2],[28,1,28,2],[31,1,31,2],[34,1,34,2],[36,1,36,2],[39,1,39,2],[40,1,40,2],[25,1,25,2],[4,1,4,2],[7,1,7,2],[10,1,10,2],[13,1,13,2],[16,1,16,2]]}
[]
[]
[null,null,{"$f":"IF(PORTADA!$E$80=87965236,HYPERLINK(\"#MENU!C7\",\"MENÚ\"),\"\")","v":"MENÚ"}]
[null,"Apéndice 2 Clasificación de los tipos de CFDI"]
[null,"1. Comprobante de Ingreso. - Se emiten por los ingresos que obtienen los contribuyentes, ejemplo: prestación de servicios, arrendamiento, honorarios, donativos recibidos, enajenación de bienes y mercancías, incluyendo la enajenación que se realiza en operaciones de comercio exterior, etc."]
[]
[null,"Persona moral régimen general de Ley"]
[null,"Obligación de expedir CFDI\nExpedir los comprobantes fiscales por las actividades que realicen.\nFundamento: Artículo 76 fracción II LISR"]
[]
[null,"Persona moral RESICO"]
[null,"Artículo 213 LISR. Las personas morales a que se refiere este Capítulo, además de las obligaciones establecidas en otros artículos de esta Ley y en las demás disposiciones fiscales, cumplirán con las obligaciones señaladas en el Capítulo IX del Título II de la Ley del Impuesto sobre la Renta."]
[]
[null,"Persona moral título III LISR"]
[null,"Expedir y recabar los comprobantes fiscales que acrediten las enajenaciones y erogaciones que efectúen, los servicios que presten o el otorgamiento del uso o goce temporal de bienes.\nFundamento: Artículo 86 fracción II LISR"]
[]
{"$rows_left_out":37}
{"sheet":"FUNDAMENTO","index":6,"n_rows":186,"n_cols":6,"rows_kept":186,"cut":false,"hidden":false,"merged":[[7,5,18,5],[56,4,56,5],[57,4,57,5],[58,4,58,5],[59,4,59,5],[60,4,60,5],[61,4,61,5],[62,4,62,5],[63,4,63,5],[64,4,64,5],[65,4,65,5],[66,4,66,5],[70,4,70,5],[67,4,67,5],[68,4,68,5],[69,4,69,5],[71,4,71,5],[72,4,72,5],[73,4,73,5],[74,4,74,5],[75,4,75,5],[78,1,80,1],[76,4,76,5],[77,4,77,5],[78,2,78,5],[79,2,79,5],[80,2,80,5]]}
[]
[]
[null,null,null,{"$f":"IF(PORTADA!$E$80=87965236,HYPERLINK(\"#MENU!C7\",\"MENÚ\"),\"\")","v":"MENÚ"}]
[]
[null,"Campo","Fiscal","Anexo 20","Guía del SAT","Miscelánea fiscal"]
[null,"Fecha de expedición","El lugar y fecha de expedición\nFundamento: Artículo 29-A fracción III CFF\n\nArtículo 39 RCFF.- Para los efectos del artículo 29, segundo párrafo, fracción IV del Código, los contribuyentes deberán remitir al Servicio de Administración Tributaria o al proveedor de certificación de comprobantes fiscales digitales por Internet autorizados por dicho órgano desconcentrado, según sea el caso, el comprobante fiscal digital por Internet, a más tardar dentro de las veinticuatro horas siguientes a que haya tenido lugar la operación, acto o actividad de la que derivó la obligación de expedirlo.","Atributo requerido para la expresión de la fecha y hora de expedición del Comprobante Fiscal Digital por Internet. Se expresa en la forma AAAA\nMM-DDThh:mm:ss y debe corresponder con la hora local donde se expide el comprobante. ","Es la fecha y hora de expedición del comprobante fiscal. Se expresa en la forma AAAA-MM-DDThh:mm:ss y debe corresponder con la hora local donde se expide el comprobante.  \n \nEste dato lo integra el sistema que utiliza el contribuyente para la emisión del comprobante fiscal. ","Obligaciones de los proveedores en el proceso de certificación de CFDI\nQue el periodo entre la fecha de generación del documento y la fecha en la que se pretende certificar no exceda de 72 horas, o que dicho periodo sea menor a cero horas, esto lo validarán haciendo uso del huso horario correspondiente al Código Postal registrado en el campo LugarExpedicion, conforme al catálogo “CodigoPostal” del Anexo 20.\nFundamento: Regla 2.7.2.9 fracción I RMF 2024\n\nExpedición de comprobantes en operaciones con el público en general\nPara los efectos del CFDI donde consten las operaciones realizadas con el público en general, los contribuyentes podrán remitir al SAT o al PCCDFI, según sea el caso, el CFDI a más tardar dentro de las 24 horas siguientes al cierre de las operaciones realizadas de manera diaria, semanal, mensual o bimestral.\nFundamento: Regla 2.7.1.21 quinto párrafo RMF 2024"]
[]
[null,null,null,null,null,"Ley Federal del Consumidor\n\nARTÍCULO 12.- Sin perjuicio de lo dispuesto por la legislación fiscal, el proveedor, tiene obligación de entregar al consumidor factura, recibo o comprobante, en el que consten los datos específicos de la compraventa, servicio prestado u operación realizada. \n\nARTÍCULO 128.- Las infracciones a lo dispuesto por los artículos 7, 8, 10, 10 BIS, 12, 44, 63, 63 Bis, 63 Ter, 63 Quintus, 65, 65 Bis, 65 Bis 1, 65 Bis 2, 65 Bis 3, 65 Bis 4, 65 Bis 5, 65 Bis 6, 65 Bis 7, 66, 73, 73 Bis, 73 Ter, 73 Quáter, 73 Quintus, 74, 76 Bis, 80, 86 Bis, 87, 87 Ter, 92, 92 Ter, 98 Bis, y 121 serán sancionadas con multa de $1,007.20 a $3’939,305.36."]
[]
[]
[]
[]
[]
[]
[]
{"$rows_left_out":172}
{"sheet":"FUNDAMENTOR","index":7,"n_rows":54,"n_cols":4,"rows_kept":54,"cut":false,"hidden":false,"merged":[[43,2,43,3],[14,1,20,1],[19,2,19,3],[20,2,20,3],[21,2,21,3],[39,2,39,3],[53,2,53,3],[8,2,8,3],[9,2,9,3],[10,2,10,3],[11,2,11,3],[51,2,51,3],[45,2,45,3],[47,1,47,3],[48,2,48,3],[49,2,49,3],[48,1,49,1],[4,1,11,1],[41,2,41,3]]}
[]
[null,null,{"$f":"IF(PORTADA!$E$80=87965236,HYPERLINK(\"#MENU!C7\",\"MENÚ\"),\"\")","v":"MENÚ"}]
[]
[null,"Campo","Contribuyente receptor","Requisito de las deducciones"]
[null,"Fecha de expedición","Persona moral régimen general de Ley","Que al realizar las operaciones correspondientes o a más tardar el último día del ejercicio se reúnan los requisitos que para cada deducción en particular establece esta Ley. Tratándose del comprobante fiscal a que se refiere el primer párrafo de la fracción III de este artículo, éste se obtenga a más tardar el día en que el contribuyente deba presentar su declaración. Respecto de la documentación comprobatoria de las retenciones y de los pagos a que se refieren las fracciones V y VI de este artículo, respectivamente, los mismos se realicen en los plazos que al efecto establecen las disposiciones fiscales, y la documentación comprobatoria se obtenga en dicha fecha. Tratándose de las declaraciones informativas a que se refieren los artículos 76 de esta Ley, y 32, fracciones V y VIII de la Ley del Impuesto al Valor Agregado, éstas se deberán presentar en los plazos que al efecto establece el citado artículo 76 y contar a partir de esa fecha con los comprobantes fiscales correspondientes. Además, la fecha de expedición de los comprobantes fiscales de un gasto deducible deberá corresponder al ejercicio por el que se efectúa la deducción.\nFundamento: Artículo 27 fracción XVIII primer párrafo LISR"]
[null,null,"Persona moral RESICO","Que al realizar las operaciones correspondientes o a más tardar el último día del ejercicio, se reúnan los requisitos que para cada deducción en particular establece esta Ley. Tratándose únicamente de los comprobantes fiscales a que se refiere el primer párrafo de la fracción III del artículo 27 de esta Ley, éstos se obtengan a más tardar el día en que el contribuyente deba presentar su declaración de pago provisional y la fecha de expedición de dicho comprobante fiscal deberá corresponder a dicho periodo de pago.\nFundamento: Artículo 210 fracción VIII LISR"]
[null,null,"Persona física actividad empresarial y profesional","Que al realizar las operaciones correspondientes o a más tardar el último día del ejercicio, se reúnan los requisitos que para cada deducción en particular establece esta Ley. Tratándose únicamente de los comprobantes fiscales a que se refiere el primer párrafo de la fracción III del artículo 27 de esta Ley, estos se obtengan a más tardar el día en que el contribuyente deba presentar su declaración del ejercicio y la fecha de expedición de dicho comprobante fiscal deberá corresponder al ejercicio en el que se efectúa la deducción.\nFundamento: Artículo 105 fracción VIII LISR"]
[null,null,"Persona física arrendamiento de inmuebles","Que al realizar las operaciones correspondientes o a más tardar el último día del ejercicio, se reúnan los requisitos que para cada deducción en lo particular establece esta Ley. Tratándose únicamente del comprobante fiscal a que se refiere el primer párrafo de la fracción IV de este artículo, éste se obtenga a más tardar el día en que el contribuyente deba presentar su declaración del ejercicio y la fecha de expedición del comprobante fiscal deberá corresponder al ejercicio en el que se efectúa la deducción. Tratándose de las declaraciones informativas a que se refieren los artículos 76 de esta Ley y 32, fracciones V y VIII de la Ley del Impuesto al Valor Agregado, éstas se deberán presentar en los plazos que al efecto establece el citado artículo 76 y contar a partir de esa fecha con los comprobantes fiscales correspondientes.\nFundamento: Artículo 147 fracción VIII LISR"]
[null,null,"Requisito de acreditamiento del IVA"]
[null,null,"Que el impuesto al valor agregado trasladado al contribuyente haya sido efectivamente pagado en el mes de que se trate\nFundamento: Artículo 5 fracción III LIVA"]
[null,null,"Requitiso de acreditamiento IEPS"]
[null,null,"Que el impuesto que le haya sido trasladado al contribuyente y que éste pretenda acreditar, haya sido efectivamente pagado a quien efectuó dicho traslado.\nFundamento: Artículo 4 fracción III LIEPS"]
[]
[null,"Campo","Contribuyente receptor","Requisito de las deducciones"]
[null,"Forma de pago","Persona moral régimen general de Ley","Estar amparadas con un comprobante fiscal y que los pagos cuyo monto exceda de $2,000.00 se efectúen mediante transferencia electrónica de fondos desde cuentas abiertas a nombre del contribuyente en instituciones que componen el sistema financiero y las entidades que para tal efecto autorice el Banco de México; cheque nominativo de la cuenta del contribuyente, tarjeta de crédito, de débito, de servicios, o los denominados monederos electrónicos autorizados por el Servicio de Administración Tributaria.\n\n\tTratándose de la adquisición de combustibles para vehículos marítimos, aéreos y terrestres, el pago deberá efectuarse en la forma señalada en el párrafo anterior, aun cuando la contraprestación de dichas adquisiciones no excedan de $2,000.00 y en el comprobante fiscal deberá constar la información del permiso vigente, expedido en los términos de la Ley de Hidrocarburos al proveedor del combustible y que, en su caso, dicho permiso no se encuentre suspendido, al momento de la expedición del comprobante fiscal.\nFundamento: Artículo 27 fracción III segundo y tercer párrafo LISR"]
{"$rows_left_out":40}
{"sheet":"DESCRIPCIÓN","index":8,"n_rows":114,"n_cols":4,"rows_kept":114,"cut":false,"hidden":false,"merged":[]}
[]
[null,null,null,{"$f":"IF(PORTADA!$E$80=87965236,HYPERLINK(\"#MENU!C7\",\"MENÚ\"),\"\")","v":"MENÚ"}]
[]
[]
[]
[]
[]
[]
[]
[]
[]
[]
[]
[]
[]
{"$rows_left_out":100}
{"sheet":"RETENCION","index":9,"n_rows":9,"n_cols":3,"rows_kept":9,"cut":false,"hidden":false,"merged":[[5,1,6,1]]}
[]
[null,{"$f":"IF(PORTADA!$E$80=87965236,HYPERLINK(\"#MENU!C7\",\"MENÚ\"),\"\")","v":"MENÚ"}]
[]
[null,"Régimen 606 solo persona física","Artículo 116 quinto párrafo LISR\nCuando los ingresos a que se refiere este Capítulo se obtengan por pagos que efectúen las personas morales, éstas deberán retener como pago provisional el monto que resulte de aplicar la tasa del 10% sobre el monto de los mismos, sin deducción alguna, debiendo proporcionar a los contribuyentes comprobante fiscal en el que conste el monto del impuesto retenido; dichas retenciones deberán enterarse, en su caso, conjuntamente con las señaladas en el artículo 96 de esta Ley. El impuesto retenido en los términos de este párrafo podrá acreditarse contra el que resulte de conformidad con el segundo párrafo de este artículo."]
[null,"Régimen 612 solo en el caso de servicios profesionales","Artículo 106 quinto párrafo LISR\nCuando los contribuyentes presten servicios profesionales a las personas morales, éstas deberán retener, como pago provisional, el monto que resulte de aplicar la tasa del 10% sobre el monto de los pagos que les efectúen, sin deducción alguna, debiendo proporcionar a los contribuyentes comprobante fiscal en el que conste el monto del impuesto retenido, el cual deberá enterarse, en su caso, conjuntamente con las retenciones señaladas en el artículo 96 de esta Ley. El impuesto retenido en los términos de este párrafo será acreditable contra el impuesto a pagar que resulte en los pagos provisionales de conformidad con este artículo."]
[null,"Régimen 626 solo persona física","Artículo 113-J. Cuando los contribuyentes a que se refiere el artículo 113-E de esta Ley realicen actividades empresariales, profesionales u otorguen el uso o goce temporal de bienes, a personas morales, estas últimas deberán retener, como pago mensual, el monto que resulte de aplicar la tasa del 1.25% sobre el monto de los pagos que les efectúen, sin considerar el impuesto al valor agregado, debiendo proporcionar a los contribuyentes el comprobante fiscal en el que conste el monto del impuesto retenido, el cual deberá enterarse por dicha persona moral a más tardar el día 17 del mes inmediato posterior a aquél al que corresponda el pago.\n\nEl impuesto retenido en los términos de este artículo será considerado en el pago mensual que deban presentar las personas físicas."]
[null,null,"Excepción para las personas morales de retener a las personas físicas dedicadas a las actividades agrícolas, ganaderas, silvícolas o pesqueras, que se encuentren exentas\n3.13.27.\tPara los efectos del artículo 113-J de la Ley del ISR, cuando las personas físicas que se dediquen exclusivamente a las actividades agrícolas, ganaderas, silvícolas o pesqueras, realicen operaciones derivadas de estas actividades con personas morales, estas últimas quedarán relevadas de efectuar la retención del 1.25% por los pagos realizados a las citadas personas físicas. Lo anterior, siempre que dichos ingresos se encuentren exentos en términos de lo establecido por el artículo 113-E, noveno párrafo de la citada Ley y en el CFDI que ampare la operación, las personas físicas señalen en el atributo “Descripción”, lo siguiente: “Los ingresos que ampara este comprobante se encuentran en el supuesto de exención a que se refiere el artículo 113-E, noveno párrafo de la Ley del ISR”.\nLISR 113-E, 113-J"]
[]
[null,"Artículo 1-A LIVA"]

{"sheet":"OBJETO","index":10,"n_rows":132,"n_cols":6,"rows_kept":132,"cut":false,"hidden":false,"merged":[[79,2,79,5],[80,3,84,3],[80,4,82,4]]}
[]
[null,null,null,null,{"$f":"IF(PORTADA!$E$80=87965236,HYPERLINK(\"#MENU!C7\",\"MENÚ\"),\"\")","v":"MENÚ"}]
[null,"c_ObjetoImp","Descripción","Fecha inicio de vigencia","Fecha fin de vigencia"]
["①","01","No objeto de impuesto.","2022-01-01"]
["②","02","Sí objeto de impuesto.","2022-01-01"]
["③","03","Sí objeto del impuesto y no obligado al desglose.","2022-01-01"]
["④","04","Sí objeto del impuesto y no causa impuesto.","2022-10-07"]
["⑤","05","Sí objeto del impuesto, IVA crédito PODEBI.","2023-12-06"]
[]
[]
["①"]
[]
[]
[]
[]
{"$rows_left_out":118}
{"sheet":"DATOS","index":11,"n_rows":17,"n_cols":3,"rows_kept":17,"cut":false,"hidden":true,"merged":[]}
[]
[]
[]
[]
[null,"Fecha de expedición *","RFC *"]
[null,"Serie **","Nombre *"]
[null,"Folio **","Domicilio fiscal del receptor *"]
[null," ","Residencia fiscal ***"]
[null,"Forma de pago ***","No. de registro tributario ***"]
[null,"Método de pago ***","Régimen fiscal *"]
[null,"Moneda *","Uso del CFDI *"]
[null,"Tipo de cambio ***"]
[null,"Tipo de comprobante *"]
[null,"Exportación *"]
[null,"Lugar de expedición *"]
{"$rows_left_out":3}
{"sheet":"CATALOGO","index":12,"n_rows":79,"n_cols":10,"rows_kept":79,"cut":false,"hidden":true,"merged":[[49,7,50,7],[49,8,50,8],[49,9,50,9]]}
[]
[]
[]
[]
[null,"c_Exportacion","Descripción"]
[null,1,"No aplica"]
[null,2,"Definitiva con clave A1"]
[null,3,"Temporal"]
[null,4,"Definitiva con clave distinta a A1 o cuando no existe enajenación en términos del CFF"]
[]
[null,"c_RegimenFiscal","Descripción"]
[null,601,"General de Ley Personas Morales"]
[null,603,"Personas Morales con Fines no Lucrativos"]
[null,605,"Sueldos y Salarios e Ingresos Asimilados a Salarios"]
[null,606,"Arrendamiento"]
{"$rows_left_out":64}